BDBM3485 3-[6-(2,6-dichlorophenyl)-2-{[3-(4-methylpiperazin-1-yl)propyl]amino}pyrido[2,3-d]pyrimidin-7-yl]-1-(2-methoxyphenyl)urea::6-arylpyrido[2,3-d]pyrimidine deriv. 67
SMILES: COc1ccccc1NC(=O)Nc1nc2nc(NCCCN3CCN(C)CC3)ncc2cc1-c1c(Cl)cccc1Cl
InChI Key: InChIKey=DFSRCPBSJAXTNU-UHFFFAOYSA-N
Data: 3 IC50
Activity Spreadsheet -- Enzyme Inhibition Constant Data from BindingDB
Found 3 hits for monomerid = 3485
Trg + Lig
Ki
nM
ΔG°
kcal/mole
IC50
nM
Kd
nM
EC50/IC50
nM
koff
s-1
kon
M-1s-1
pHTemp
°C
Platelet-derived growth factor receptor beta
(Homo sapiens (Human))
BDBM3485
(3-[6-(2,6-dichlorophenyl)-2-{[3-(4-methylpiperazin...)
Show SMILES COc1ccccc1NC(=O)Nc1nc2nc(NCCCN3CCN(C)CC3)ncc2cc1-c1c(Cl)cccc1Cl |(33.16,-19.56,;31.67,-19.16,;30.34,-19.93,;30.29,-21.47,;28.93,-22.2,;27.62,-21.39,;27.67,-19.85,;29.03,-19.12,;29.03,-17.58,;27.69,-16.81,;26.36,-17.58,;27.69,-15.27,;26.36,-14.5,;25.03,-15.27,;23.69,-14.5,;22.36,-15.27,;21.03,-14.5,;19.69,-15.27,;18.36,-14.5,;16.87,-14.9,;15.78,-13.81,;14.29,-14.21,;13,-13.38,;11.63,-14.08,;11.56,-15.62,;10.23,-16.39,;12.86,-16.45,;14.22,-15.75,;21.03,-12.96,;22.36,-12.19,;23.69,-12.96,;25.03,-12.19,;26.36,-12.96,;27.69,-12.19,;27.69,-10.65,;26.36,-9.88,;29.03,-9.88,;30.36,-10.65,;30.36,-12.19,;29.03,-12.96,;29.03,-14.5,)|
Show InChI InChI=1S/C29H32Cl2N8O2/c1-38-13-15-39(16-14-38)12-6-11-32-28-33-18-19-17-20(25-21(30)7-5-8-22(25)31)27(35-26(19)36-28)37-29(40)34-23-9-3-4-10-24(23)41-2/h3-5,7-10,17-18H,6,11-16H2,1-2H3,(H3,32,33,34,35,36,37,40)
NCI pathway
Reactome pathway
n/an/a 660n/an/an/an/an/an/a
Pfizer
Assay Description
IC50 is the inhibitor concentration which inhibits 50% of kinase activity that catalyzes the transfer of the terminal phosphate from [gamma-32P] labe...
J Med Chem 44: 1915-26 (2001)
Article DOI: 10.1021/jm0004291
BindingDB Entry DOI: 10.7270/Q29K48DG
Proto-oncogene tyrosine-protein kinase Src
(Homo sapiens (Human))
BDBM3485
(3-[6-(2,6-dichlorophenyl)-2-{[3-(4-methylpiperazin...)
Show SMILES COc1ccccc1NC(=O)Nc1nc2nc(NCCCN3CCN(C)CC3)ncc2cc1-c1c(Cl)cccc1Cl |(33.16,-19.56,;31.67,-19.16,;30.34,-19.93,;30.29,-21.47,;28.93,-22.2,;27.62,-21.39,;27.67,-19.85,;29.03,-19.12,;29.03,-17.58,;27.69,-16.81,;26.36,-17.58,;27.69,-15.27,;26.36,-14.5,;25.03,-15.27,;23.69,-14.5,;22.36,-15.27,;21.03,-14.5,;19.69,-15.27,;18.36,-14.5,;16.87,-14.9,;15.78,-13.81,;14.29,-14.21,;13,-13.38,;11.63,-14.08,;11.56,-15.62,;10.23,-16.39,;12.86,-16.45,;14.22,-15.75,;21.03,-12.96,;22.36,-12.19,;23.69,-12.96,;25.03,-12.19,;26.36,-12.96,;27.69,-12.19,;27.69,-10.65,;26.36,-9.88,;29.03,-9.88,;30.36,-10.65,;30.36,-12.19,;29.03,-12.96,;29.03,-14.5,)|
Show InChI InChI=1S/C29H32Cl2N8O2/c1-38-13-15-39(16-14-38)12-6-11-32-28-33-18-19-17-20(25-21(30)7-5-8-22(25)31)27(35-26(19)36-28)37-29(40)34-23-9-3-4-10-24(23)41-2/h3-5,7-10,17-18H,6,11-16H2,1-2H3,(H3,32,33,34,35,36,37,40)
n/an/a 16n/an/an/an/an/an/a
Pfizer
Assay Description
IC50 is the inhibitor concentration which inhibits 50% of kinase activity that catalyzes the transfer of the terminal phosphate from [gamma-32P] labe...
J Med Chem 44: 1915-26 (2001)
Article DOI: 10.1021/jm0004291
BindingDB Entry DOI: 10.7270/Q29K48DG
Fibroblast growth factor receptor 1
(Homo sapiens (Human))
BDBM3485
(3-[6-(2,6-dichlorophenyl)-2-{[3-(4-methylpiperazin...)
Show SMILES COc1ccccc1NC(=O)Nc1nc2nc(NCCCN3CCN(C)CC3)ncc2cc1-c1c(Cl)cccc1Cl |(33.16,-19.56,;31.67,-19.16,;30.34,-19.93,;30.29,-21.47,;28.93,-22.2,;27.62,-21.39,;27.67,-19.85,;29.03,-19.12,;29.03,-17.58,;27.69,-16.81,;26.36,-17.58,;27.69,-15.27,;26.36,-14.5,;25.03,-15.27,;23.69,-14.5,;22.36,-15.27,;21.03,-14.5,;19.69,-15.27,;18.36,-14.5,;16.87,-14.9,;15.78,-13.81,;14.29,-14.21,;13,-13.38,;11.63,-14.08,;11.56,-15.62,;10.23,-16.39,;12.86,-16.45,;14.22,-15.75,;21.03,-12.96,;22.36,-12.19,;23.69,-12.96,;25.03,-12.19,;26.36,-12.96,;27.69,-12.19,;27.69,-10.65,;26.36,-9.88,;29.03,-9.88,;30.36,-10.65,;30.36,-12.19,;29.03,-12.96,;29.03,-14.5,)|
Show InChI InChI=1S/C29H32Cl2N8O2/c1-38-13-15-39(16-14-38)12-6-11-32-28-33-18-19-17-20(25-21(30)7-5-8-22(25)31)27(35-26(19)36-28)37-29(40)34-23-9-3-4-10-24(23)41-2/h3-5,7-10,17-18H,6,11-16H2,1-2H3,(H3,32,33,34,35,36,37,40)
NCI pathway
Reactome pathway
n/an/a 67n/an/an/an/an/an/a
Pfizer
Assay Description
IC50 is the inhibitor concentration which inhibits 50% of kinase activity that catalyzes the transfer of the terminal phosphate from [gamma-32P] labe...
J Med Chem 44: 1915-26 (2001)
Article DOI: 10.1021/jm0004291
BindingDB Entry DOI: 10.7270/Q29K48DG