BDBM349602 US10208000, Compound 44
SMILES: CCCCc1cccc(c1)N(C)S(=O)(=O)c1ccc2[nH]c(=O)c(=O)[nH]c2c1
InChI Key: InChIKey=BNSNDRZCWYKODE-UHFFFAOYSA-N
Data: 1 IC50
Activity Spreadsheet -- Enzyme Inhibition Constant Data from BindingDB
Found 1 hit for monomerid = 349602
Trg + Lig
Ki
nM
ΔG°
kcal/mole
IC50
nM
Kd
nM
EC50/IC50
nM
koff
s-1
kon
M-1s-1
pHTemp
°C
N-acetyltransferase Eis
(Mycobacterium tuberculosis (strain ATCC 25618 / H3...)
BDBM349602
(US10208000, Compound 44)
Show SMILES CCCCc1cccc(c1)N(C)S(=O)(=O)c1ccc2[nH]c(=O)c(=O)[nH]c2c1
Show InChI InChI=1S/C19H21N3O4S/c1-3-4-6-13-7-5-8-14(11-13)22(2)27(25,26)15-9-10-16-17(12-15)21-19(24)18(23)20-16/h5,7-12H,3-4,6H2,1-2H3,(H,20,23)(H,21,24)
US Patent
n/an/a 700n/an/an/an/an/an/a
University of Kentucky Research Foundation
US Patent
Assay Description
To investigate the potential of these compounds as Eis inhibitors for use in combination with KAN, their biochemical (IC50 values against purified Ei...
US Patent US10208000 (2019)
BindingDB Entry DOI: 10.7270/Q28S4S2Z