BDBM350211 US10208056, Compound 43
SMILES: CCn1c(cc2c1-c1ccncc1OC2(C)C)C(N)=O
InChI Key: InChIKey=HAUGVIAEKSQIGA-UHFFFAOYSA-N
Data: 3 IC50
Activity Spreadsheet -- Enzyme Inhibition Constant Data from BindingDB
Found 3 hits for monomerid = 350211
Trg + Lig
Ki
nM
ΔG°
kcal/mole
IC50
nM
Kd
nM
EC50/IC50
nM
koff
s-1
kon
M-1s-1
pHTemp
°C
CDK8/Cyclin C
(Homo sapiens (Human))
BDBM350211
(US10208056, Compound 43)
Show SMILES CCn1c(cc2c1-c1ccncc1OC2(C)C)C(N)=O
Show InChI InChI=1S/C15H17N3O2/c1-4-18-11(14(16)19)7-10-13(18)9-5-6-17-8-12(9)20-15(10,2)3/h5-8H,4H2,1-3H3,(H2,16,19)
US Patent
n/an/a 1.41n/an/an/an/an/an/a
FUNDACIÓN DEL SECTOR PÚBLICO ESTATAL CENTRO NACIONAL DE INVESTIGACIONES ONCOLÓGICAS CARLOS III (F.S.P. CNIO)
US Patent
Assay Description
The binding assay relies on the LanthaScreen™ Eu-Kinase Binding Assay (Invitrogen. This is a kinase assay platform based on measuring the binding and...
US Patent US10208056 (2019)
BindingDB Entry DOI: 10.7270/Q2GB266B
CDK19/Cyclin C
(Homo sapiens (Human))
BDBM350211
(US10208056, Compound 43)
Show SMILES CCn1c(cc2c1-c1ccncc1OC2(C)C)C(N)=O
Show InChI InChI=1S/C15H17N3O2/c1-4-18-11(14(16)19)7-10-13(18)9-5-6-17-8-12(9)20-15(10,2)3/h5-8H,4H2,1-3H3,(H2,16,19)
US Patent
n/an/a 1.09n/an/an/an/an/an/a
FUNDACIÓN DEL SECTOR PÚBLICO ESTATAL CENTRO NACIONAL DE INVESTIGACIONES ONCOLÓGICAS CARLOS III (F.S.P. CNIO)
US Patent
Assay Description
The binding assay relies on the LanthaScreen™ Eu-Kinase Binding Assay (Invitrogen). This is a kinase assay platform based on measuring the binding an...
US Patent US10208056 (2019)
BindingDB Entry DOI: 10.7270/Q2GB266B
Serine/threonine-protein kinase haspin
(Homo sapiens (Human))
BDBM350211
(US10208056, Compound 43)
Show SMILES CCn1c(cc2c1-c1ccncc1OC2(C)C)C(N)=O
Show InChI InChI=1S/C15H17N3O2/c1-4-18-11(14(16)19)7-10-13(18)9-5-6-17-8-12(9)20-15(10,2)3/h5-8H,4H2,1-3H3,(H2,16,19)
US Patent
n/an/a 36.8n/an/an/an/an/an/a
FUNDACIÓN DEL SECTOR PÚBLICO ESTATAL CENTRO NACIONAL DE INVESTIGACIONES ONCOLÓGICAS CARLOS III (F.S.P. CNIO)
US Patent
Assay Description
The kinase assay relies on ADP-GloKM biochemical kinase assay (Promega). This is a luminescent kinase assay that measures ADP formed from a kinase re...
US Patent US10208056 (2019)
BindingDB Entry DOI: 10.7270/Q2GB266B