BDBM35028 benzothienopyrimidinone deriv., 14m
SMILES: CN(C)Cc1nc2c3cc(ccc3sc2c(=O)[nH]1)-c1ccc(O)c(F)c1
InChI Key: InChIKey=RDPIVXMVUFXNIS-UHFFFAOYSA-N
Data: 2 KI
Activity Spreadsheet -- Enzyme Inhibition Constant Data from BindingDB
Found 2 hits for monomerid = 35028
Trg + Lig
Ki
nM
ΔG°
kcal/mole
IC50
nM
Kd
nM
EC50/IC50
nM
koff
s-1
kon
M-1s-1
pHTemp
°C
Serine/threonine-protein kinase pim-1
(Homo sapiens (Human))
BDBM35028
(benzothienopyrimidinone deriv., 14m)
Show SMILES CN(C)Cc1nc2c3cc(ccc3sc2c(=O)[nH]1)-c1ccc(O)c(F)c1
Show InChI InChI=1S/C19H16FN3O2S/c1-23(2)9-16-21-17-12-7-10(11-3-5-14(24)13(20)8-11)4-6-15(12)26-18(17)19(25)22-16/h3-8,24H,9H2,1-2H3,(H,21,22,25)
1 -12.3n/an/an/an/an/an/a25
Abbott Laboratories
Assay Description
In 384-well v-bottom polypropylene plates, compound (2% DMSO) was mixed with Pim kinase and peptide substrate, followed by immediate initiation with ...
J Med Chem 52: 6621-36 (2009)
Article DOI: 10.1021/jm900943h
BindingDB Entry DOI: 10.7270/Q27P8WQW
Serine/threonine-protein kinase pim-2
(Homo sapiens (Human))
BDBM35028
(benzothienopyrimidinone deriv., 14m)
Show SMILES CN(C)Cc1nc2c3cc(ccc3sc2c(=O)[nH]1)-c1ccc(O)c(F)c1
Show InChI InChI=1S/C19H16FN3O2S/c1-23(2)9-16-21-17-12-7-10(11-3-5-14(24)13(20)8-11)4-6-15(12)26-18(17)19(25)22-16/h3-8,24H,9H2,1-2H3,(H,21,22,25)
5 -11.3n/an/an/an/an/an/a25
Abbott Laboratories
Assay Description
In 384-well v-bottom polypropylene plates, compound (2% DMSO) was mixed with Pim kinase and peptide substrate, followed by immediate initiation with ...
J Med Chem 52: 6621-36 (2009)
Article DOI: 10.1021/jm900943h
BindingDB Entry DOI: 10.7270/Q27P8WQW