BDBM35031 benzothienopyrimidinone deriv., 14p
SMILES: CN(C)Cc1nc2c3cc(ccc3sc2c(=O)[nH]1)-c1cc(F)cc(Cl)c1
InChI Key: InChIKey=SCIQGAHHNPDKAJ-UHFFFAOYSA-N
Data: 2 KI
Activity Spreadsheet -- Enzyme Inhibition Constant Data from BindingDB
Found 2 hits for monomerid = 35031
Trg + Lig
Ki
nM
ΔG°
kcal/mole
IC50
nM
Kd
nM
EC50/IC50
nM
koff
s-1
kon
M-1s-1
pHTemp
°C
Serine/threonine-protein kinase pim-1
(Homo sapiens (Human))
BDBM35031
(benzothienopyrimidinone deriv., 14p)
Show SMILES CN(C)Cc1nc2c3cc(ccc3sc2c(=O)[nH]1)-c1cc(F)cc(Cl)c1
Show InChI InChI=1S/C19H15ClFN3OS/c1-24(2)9-16-22-17-14-7-10(11-5-12(20)8-13(21)6-11)3-4-15(14)26-18(17)19(25)23-16/h3-8H,9H2,1-2H3,(H,22,23,25)
3 -11.6n/an/an/an/an/an/a25
Abbott Laboratories
Assay Description
In 384-well v-bottom polypropylene plates, compound (2% DMSO) was mixed with Pim kinase and peptide substrate, followed by immediate initiation with ...
J Med Chem 52: 6621-36 (2009)
Article DOI: 10.1021/jm900943h
BindingDB Entry DOI: 10.7270/Q27P8WQW
Serine/threonine-protein kinase pim-2
(Homo sapiens (Human))
BDBM35031
(benzothienopyrimidinone deriv., 14p)
Show SMILES CN(C)Cc1nc2c3cc(ccc3sc2c(=O)[nH]1)-c1cc(F)cc(Cl)c1
Show InChI InChI=1S/C19H15ClFN3OS/c1-24(2)9-16-22-17-14-7-10(11-5-12(20)8-13(21)6-11)3-4-15(14)26-18(17)19(25)23-16/h3-8H,9H2,1-2H3,(H,22,23,25)
45 -10.0n/an/an/an/an/an/a25
Abbott Laboratories
Assay Description
In 384-well v-bottom polypropylene plates, compound (2% DMSO) was mixed with Pim kinase and peptide substrate, followed by immediate initiation with ...
J Med Chem 52: 6621-36 (2009)
Article DOI: 10.1021/jm900943h
BindingDB Entry DOI: 10.7270/Q27P8WQW