BDBM350411 US10208066, Compound 29::US10611777, Compound 29
SMILES: CCC(Nc1ncnc(N)c1C#N)c1cc2ncc(Cl)n2nc1-c1ccccn1
InChI Key: InChIKey=LTZAFUIAXJDTFA-UHFFFAOYSA-N
Data: 4 IC50
Activity Spreadsheet -- Enzyme Inhibition Constant Data from BindingDB
Found 4 hits for monomerid = 350411
Trg + Lig
Ki
nM
ΔG°
kcal/mole
IC50
nM
Kd
nM
EC50/IC50
nM
koff
s-1
kon
M-1s-1
pHTemp
°C
Phosphatidylinositol 4,5-bisphosphate 3-kinase catalytic subunit delta isoform
(Homo sapiens (Human))
BDBM350411
(US10208066, Compound 29 | US10611777, Compound 29)
Show SMILES CCC(Nc1ncnc(N)c1C#N)c1cc2ncc(Cl)n2nc1-c1ccccn1
Show InChI InChI=1S/C19H16ClN9/c1-2-13(27-19-12(8-21)18(22)25-10-26-19)11-7-16-24-9-15(20)29(16)28-17(11)14-5-3-4-6-23-14/h3-7,9-10,13H,2H2,1H3,(H3,22,25,26,27)
NCI pathway
Reactome pathway
US Patent
n/an/a 3n/an/an/an/an/an/a
HUTCHISON MEDIPHARMA LIMITED
US Patent
Assay Description
Briefly, the Transcreener KINASE Assay was designed as a simple two-part, endpoint assay as follows:1) Preparation of 25 uL kinase reaction: the 25 u...
US Patent US10208066 (2019)
BindingDB Entry DOI: 10.7270/Q2319Z0W
Phosphatidylinositol 3-kinase regulatory subunit beta
(Homo sapiens (Human))
BDBM350411
(US10208066, Compound 29 | US10611777, Compound 29)
Show SMILES CCC(Nc1ncnc(N)c1C#N)c1cc2ncc(Cl)n2nc1-c1ccccn1
Show InChI InChI=1S/C19H16ClN9/c1-2-13(27-19-12(8-21)18(22)25-10-26-19)11-7-16-24-9-15(20)29(16)28-17(11)14-5-3-4-6-23-14/h3-7,9-10,13H,2H2,1H3,(H3,22,25,26,27)
NCI pathway
Reactome pathway
US Patent
n/an/a 174n/an/an/an/an/an/a
HUTCHISON MEDIPHARMA LIMITED
US Patent
Assay Description
PI3K kinases including p110α/p85α and p110γ were purchased from Invitrogen, p110δ/p85α and p110β/p85α were from Mi...
US Patent US10611777 (2020)
Phosphatidylinositol 4,5-bisphosphate 3-kinase catalytic subunit delta isoform
(Homo sapiens (Human))
BDBM350411
(US10208066, Compound 29 | US10611777, Compound 29)
Show SMILES CCC(Nc1ncnc(N)c1C#N)c1cc2ncc(Cl)n2nc1-c1ccccn1
Show InChI InChI=1S/C19H16ClN9/c1-2-13(27-19-12(8-21)18(22)25-10-26-19)11-7-16-24-9-15(20)29(16)28-17(11)14-5-3-4-6-23-14/h3-7,9-10,13H,2H2,1H3,(H3,22,25,26,27)
NCI pathway
Reactome pathway
US Patent
n/an/a 3n/an/an/an/an/an/a
HUTCHISON MEDIPHARMA LIMITED
US Patent
Assay Description
PI3K kinases including p110α/p85α and p110γ were purchased from Invitrogen, p110δ/p85α and p110β/p85α were from Mi...
US Patent US10611777 (2020)
Phosphatidylinositol 3-kinase regulatory subunit beta
(Homo sapiens (Human))
BDBM350411
(US10208066, Compound 29 | US10611777, Compound 29)
Show SMILES CCC(Nc1ncnc(N)c1C#N)c1cc2ncc(Cl)n2nc1-c1ccccn1
Show InChI InChI=1S/C19H16ClN9/c1-2-13(27-19-12(8-21)18(22)25-10-26-19)11-7-16-24-9-15(20)29(16)28-17(11)14-5-3-4-6-23-14/h3-7,9-10,13H,2H2,1H3,(H3,22,25,26,27)
NCI pathway
Reactome pathway
US Patent
n/an/a 174n/an/an/an/an/an/a
HUTCHISON MEDIPHARMA LIMITED
US Patent
Assay Description
Briefly, the Transcreener KINASE Assay was designed as a simple two-part, endpoint assay as follows:1) Preparation of 25 uL kinase reaction: the 25 u...
US Patent US10208066 (2019)
BindingDB Entry DOI: 10.7270/Q2319Z0W