BDBM350417 US10208066, Compound 36::US10611777, Compound 36
SMILES: C[C@H](Nc1ncnc(N)c1C#N)c1cc2ncc(Cl)n2nc1-c1cccc(F)c1F
InChI Key: InChIKey=LDKNAQHGUMVNBB-VIFPVBQESA-N
Data: 6 IC50
Activity Spreadsheet -- Enzyme Inhibition Constant Data from BindingDB
Found 6 hits for monomerid = 350417
Trg + Lig
Ki
nM
ΔG°
kcal/mole
IC50
nM
Kd
nM
EC50/IC50
nM
koff
s-1
kon
M-1s-1
pHTemp
°C
Phosphatidylinositol 4,5-bisphosphate 3-kinase catalytic subunit delta isoform
(Homo sapiens (Human))
BDBM350417
(US10208066, Compound 36 | US10611777, Compound 36)
Show SMILES C[C@H](Nc1ncnc(N)c1C#N)c1cc2ncc(Cl)n2nc1-c1cccc(F)c1F |r|
Show InChI InChI=1S/C19H13ClF2N8/c1-9(28-19-12(6-23)18(24)26-8-27-19)11-5-15-25-7-14(20)30(15)29-17(11)10-3-2-4-13(21)16(10)22/h2-5,7-9H,1H3,(H3,24,26,27,28)/t9-/m0/s1
NCI pathway
Reactome pathway
US Patent
n/an/a 3n/an/an/an/an/an/a
HUTCHISON MEDIPHARMA LIMITED
US Patent
Assay Description
Briefly, the Transcreener KINASE Assay was designed as a simple two-part, endpoint assay as follows:1) Preparation of 25 uL kinase reaction: the 25 u...
US Patent US10208066 (2019)
BindingDB Entry DOI: 10.7270/Q2319Z0W
Phosphatidylinositol 4,5-bisphosphate 3-kinase catalytic subunit gamma isoform
(Homo sapiens (Human))
BDBM350417
(US10208066, Compound 36 | US10611777, Compound 36)
Show SMILES C[C@H](Nc1ncnc(N)c1C#N)c1cc2ncc(Cl)n2nc1-c1cccc(F)c1F |r|
Show InChI InChI=1S/C19H13ClF2N8/c1-9(28-19-12(6-23)18(24)26-8-27-19)11-5-15-25-7-14(20)30(15)29-17(11)10-3-2-4-13(21)16(10)22/h2-5,7-9H,1H3,(H3,24,26,27,28)/t9-/m0/s1
NCI pathway
Reactome pathway
US Patent
n/an/a 243n/an/an/an/an/an/a
HUTCHISON MEDIPHARMA LIMITED
US Patent
Assay Description
Briefly, the Transcreener KINASE Assay was designed as a simple two-part, endpoint assay as follows:1) Preparation of 25 uL kinase reaction: the 25 u...
US Patent US10208066 (2019)
BindingDB Entry DOI: 10.7270/Q2319Z0W
Phosphatidylinositol 3-kinase regulatory subunit beta
(Homo sapiens (Human))
BDBM350417
(US10208066, Compound 36 | US10611777, Compound 36)
Show SMILES C[C@H](Nc1ncnc(N)c1C#N)c1cc2ncc(Cl)n2nc1-c1cccc(F)c1F |r|
Show InChI InChI=1S/C19H13ClF2N8/c1-9(28-19-12(6-23)18(24)26-8-27-19)11-5-15-25-7-14(20)30(15)29-17(11)10-3-2-4-13(21)16(10)22/h2-5,7-9H,1H3,(H3,24,26,27,28)/t9-/m0/s1
NCI pathway
Reactome pathway
US Patent
n/an/a 1.31E+3n/an/an/an/an/an/a
HUTCHISON MEDIPHARMA LIMITED
US Patent
Assay Description
PI3K kinases including p110α/p85α and p110γ were purchased from Invitrogen, p110δ/p85α and p110β/p85α were from Mi...
US Patent US10611777 (2020)
Phosphatidylinositol 4,5-bisphosphate 3-kinase catalytic subunit delta isoform
(Homo sapiens (Human))
BDBM350417
(US10208066, Compound 36 | US10611777, Compound 36)
Show SMILES C[C@H](Nc1ncnc(N)c1C#N)c1cc2ncc(Cl)n2nc1-c1cccc(F)c1F |r|
Show InChI InChI=1S/C19H13ClF2N8/c1-9(28-19-12(6-23)18(24)26-8-27-19)11-5-15-25-7-14(20)30(15)29-17(11)10-3-2-4-13(21)16(10)22/h2-5,7-9H,1H3,(H3,24,26,27,28)/t9-/m0/s1
NCI pathway
Reactome pathway
US Patent
n/an/a 3n/an/an/an/an/an/a
HUTCHISON MEDIPHARMA LIMITED
US Patent
Assay Description
PI3K kinases including p110α/p85α and p110γ were purchased from Invitrogen, p110δ/p85α and p110β/p85α were from Mi...
US Patent US10611777 (2020)
Phosphatidylinositol 4,5-bisphosphate 3-kinase catalytic subunit gamma isoform
(Homo sapiens (Human))
BDBM350417
(US10208066, Compound 36 | US10611777, Compound 36)
Show SMILES C[C@H](Nc1ncnc(N)c1C#N)c1cc2ncc(Cl)n2nc1-c1cccc(F)c1F |r|
Show InChI InChI=1S/C19H13ClF2N8/c1-9(28-19-12(6-23)18(24)26-8-27-19)11-5-15-25-7-14(20)30(15)29-17(11)10-3-2-4-13(21)16(10)22/h2-5,7-9H,1H3,(H3,24,26,27,28)/t9-/m0/s1
NCI pathway
Reactome pathway
US Patent
n/an/a 243n/an/an/an/an/an/a
HUTCHISON MEDIPHARMA LIMITED
US Patent
Assay Description
PI3K kinases including p110α/p85α and p110γ were purchased from Invitrogen, p110δ/p85α and p110β/p85α were from Mi...
US Patent US10611777 (2020)
Phosphatidylinositol 3-kinase regulatory subunit beta
(Homo sapiens (Human))
BDBM350417
(US10208066, Compound 36 | US10611777, Compound 36)
Show SMILES C[C@H](Nc1ncnc(N)c1C#N)c1cc2ncc(Cl)n2nc1-c1cccc(F)c1F |r|
Show InChI InChI=1S/C19H13ClF2N8/c1-9(28-19-12(6-23)18(24)26-8-27-19)11-5-15-25-7-14(20)30(15)29-17(11)10-3-2-4-13(21)16(10)22/h2-5,7-9H,1H3,(H3,24,26,27,28)/t9-/m0/s1
NCI pathway
Reactome pathway
US Patent
n/an/a 1.31E+3n/an/an/an/an/an/a
HUTCHISON MEDIPHARMA LIMITED
US Patent
Assay Description
Briefly, the Transcreener KINASE Assay was designed as a simple two-part, endpoint assay as follows:1) Preparation of 25 uL kinase reaction: the 25 u...
US Patent US10208066 (2019)
BindingDB Entry DOI: 10.7270/Q2319Z0W