BDBM350450 US10208066, Compound 72::US10611777, Compound 72
SMILES: C[C@H](Nc1ncnc(N)c1C#N)c1cc2ncc(Cl)n2nc1-c1cnn(C)c1
InChI Key: InChIKey=GGCBEXOLGWWVQX-VIFPVBQESA-N
Data: 6 IC50
Activity Spreadsheet -- Enzyme Inhibition Constant Data from BindingDB
Found 6 hits for monomerid = 350450
Trg + Lig
Ki
nM
ΔG°
kcal/mole
IC50
nM
Kd
nM
EC50/IC50
nM
koff
s-1
kon
M-1s-1
pHTemp
°C
Phosphatidylinositol 4,5-bisphosphate 3-kinase catalytic subunit delta isoform
(Homo sapiens (Human))
BDBM350450
(US10208066, Compound 72 | US10611777, Compound 72)
Show SMILES C[C@H](Nc1ncnc(N)c1C#N)c1cc2ncc(Cl)n2nc1-c1cnn(C)c1 |r|
Show InChI InChI=1S/C17H15ClN10/c1-9(25-17-12(4-19)16(20)22-8-23-17)11-3-14-21-6-13(18)28(14)26-15(11)10-5-24-27(2)7-10/h3,5-9H,1-2H3,(H3,20,22,23,25)/t9-/m0/s1
NCI pathway
Reactome pathway
US Patent
n/an/a 4n/an/an/an/an/an/a
HUTCHISON MEDIPHARMA LIMITED
US Patent
Assay Description
Briefly, the Transcreener KINASE Assay was designed as a simple two-part, endpoint assay as follows:1) Preparation of 25 uL kinase reaction: the 25 u...
US Patent US10208066 (2019)
BindingDB Entry DOI: 10.7270/Q2319Z0W
Phosphatidylinositol 4,5-bisphosphate 3-kinase catalytic subunit gamma isoform
(Homo sapiens (Human))
BDBM350450
(US10208066, Compound 72 | US10611777, Compound 72)
Show SMILES C[C@H](Nc1ncnc(N)c1C#N)c1cc2ncc(Cl)n2nc1-c1cnn(C)c1 |r|
Show InChI InChI=1S/C17H15ClN10/c1-9(25-17-12(4-19)16(20)22-8-23-17)11-3-14-21-6-13(18)28(14)26-15(11)10-5-24-27(2)7-10/h3,5-9H,1-2H3,(H3,20,22,23,25)/t9-/m0/s1
NCI pathway
Reactome pathway
US Patent
n/an/a 513n/an/an/an/an/an/a
HUTCHISON MEDIPHARMA LIMITED
US Patent
Assay Description
Briefly, the Transcreener KINASE Assay was designed as a simple two-part, endpoint assay as follows:1) Preparation of 25 uL kinase reaction: the 25 u...
US Patent US10208066 (2019)
BindingDB Entry DOI: 10.7270/Q2319Z0W
Phosphatidylinositol 3-kinase regulatory subunit beta
(Homo sapiens (Human))
BDBM350450
(US10208066, Compound 72 | US10611777, Compound 72)
Show SMILES C[C@H](Nc1ncnc(N)c1C#N)c1cc2ncc(Cl)n2nc1-c1cnn(C)c1 |r|
Show InChI InChI=1S/C17H15ClN10/c1-9(25-17-12(4-19)16(20)22-8-23-17)11-3-14-21-6-13(18)28(14)26-15(11)10-5-24-27(2)7-10/h3,5-9H,1-2H3,(H3,20,22,23,25)/t9-/m0/s1
NCI pathway
Reactome pathway
US Patent
n/an/a 89n/an/an/an/an/an/a
HUTCHISON MEDIPHARMA LIMITED
US Patent
Assay Description
PI3K kinases including p110α/p85α and p110γ were purchased from Invitrogen, p110δ/p85α and p110β/p85α were from Mi...
US Patent US10611777 (2020)
Phosphatidylinositol 4,5-bisphosphate 3-kinase catalytic subunit delta isoform
(Homo sapiens (Human))
BDBM350450
(US10208066, Compound 72 | US10611777, Compound 72)
Show SMILES C[C@H](Nc1ncnc(N)c1C#N)c1cc2ncc(Cl)n2nc1-c1cnn(C)c1 |r|
Show InChI InChI=1S/C17H15ClN10/c1-9(25-17-12(4-19)16(20)22-8-23-17)11-3-14-21-6-13(18)28(14)26-15(11)10-5-24-27(2)7-10/h3,5-9H,1-2H3,(H3,20,22,23,25)/t9-/m0/s1
NCI pathway
Reactome pathway
US Patent
n/an/a 4n/an/an/an/an/an/a
HUTCHISON MEDIPHARMA LIMITED
US Patent
Assay Description
PI3K kinases including p110α/p85α and p110γ were purchased from Invitrogen, p110δ/p85α and p110β/p85α were from Mi...
US Patent US10611777 (2020)
Phosphatidylinositol 4,5-bisphosphate 3-kinase catalytic subunit gamma isoform
(Homo sapiens (Human))
BDBM350450
(US10208066, Compound 72 | US10611777, Compound 72)
Show SMILES C[C@H](Nc1ncnc(N)c1C#N)c1cc2ncc(Cl)n2nc1-c1cnn(C)c1 |r|
Show InChI InChI=1S/C17H15ClN10/c1-9(25-17-12(4-19)16(20)22-8-23-17)11-3-14-21-6-13(18)28(14)26-15(11)10-5-24-27(2)7-10/h3,5-9H,1-2H3,(H3,20,22,23,25)/t9-/m0/s1
NCI pathway
Reactome pathway
US Patent
n/an/a 513n/an/an/an/an/an/a
HUTCHISON MEDIPHARMA LIMITED
US Patent
Assay Description
PI3K kinases including p110α/p85α and p110γ were purchased from Invitrogen, p110δ/p85α and p110β/p85α were from Mi...
US Patent US10611777 (2020)
Phosphatidylinositol 3-kinase regulatory subunit beta
(Homo sapiens (Human))
BDBM350450
(US10208066, Compound 72 | US10611777, Compound 72)
Show SMILES C[C@H](Nc1ncnc(N)c1C#N)c1cc2ncc(Cl)n2nc1-c1cnn(C)c1 |r|
Show InChI InChI=1S/C17H15ClN10/c1-9(25-17-12(4-19)16(20)22-8-23-17)11-3-14-21-6-13(18)28(14)26-15(11)10-5-24-27(2)7-10/h3,5-9H,1-2H3,(H3,20,22,23,25)/t9-/m0/s1
NCI pathway
Reactome pathway
US Patent
n/an/a 89n/an/an/an/an/an/a
HUTCHISON MEDIPHARMA LIMITED
US Patent
Assay Description
Briefly, the Transcreener KINASE Assay was designed as a simple two-part, endpoint assay as follows:1) Preparation of 25 uL kinase reaction: the 25 u...
US Patent US10208066 (2019)
BindingDB Entry DOI: 10.7270/Q2319Z0W