BDBM35551 4-hydroxy-2H-chromen-2-one core, 28
SMILES: Cc1ccc(Cc2c(O)c3ccccc3oc2=O)cc1C
InChI Key: InChIKey=YGMVKOKEKHJHOV-UHFFFAOYSA-N
Data: 2 IC50
Activity Spreadsheet -- Enzyme Inhibition Constant Data from BindingDB
Found 2 hits for monomerid = 35551
Trg + Lig
Ki
nM
ΔG°
kcal/mole
IC50
nM
Kd
nM
EC50/IC50
nM
koff
s-1
kon
M-1s-1
pHTemp
°C
NAD(P)H dehydrogenase [quinone] 1
(Homo sapiens (Human))
BDBM35551
(4-hydroxy-2H-chromen-2-one core, 28)
Show SMILES Cc1ccc(Cc2c(O)c3ccccc3oc2=O)cc1C
Show InChI InChI=1S/C18H16O3/c1-11-7-8-13(9-12(11)2)10-15-17(19)14-5-3-4-6-16(14)21-18(15)20/h3-9,19H,10H2,1-2H3
Reactome pathway
n/an/a 31n/an/an/an/a7.5n/a
University of Manchester
Assay Description
Recombinant human NQO1 was obtained from Sigma and diluted in 50 mM phosphate buffer to give an absorbance of 0.1 at 550 nm; 5 uL of this solution wa...
J Med Chem 52: 7142-56 (2009)
Article DOI: 10.1021/jm9011609
BindingDB Entry DOI: 10.7270/Q2222S40
NAD(P)H dehydrogenase [quinone] 1
(Homo sapiens (Human))
BDBM35551
(4-hydroxy-2H-chromen-2-one core, 28)
Show SMILES Cc1ccc(Cc2c(O)c3ccccc3oc2=O)cc1C
Show InChI InChI=1S/C18H16O3/c1-11-7-8-13(9-12(11)2)10-15-17(19)14-5-3-4-6-16(14)21-18(15)20/h3-9,19H,10H2,1-2H3
Reactome pathway
n/an/a 1.60E+3n/an/an/an/a7.525
University of Manchester
Assay Description
Recombinant human NQO1 was obtained from Sigma and diluted in 50 mM phosphate buffer to give an absorbance of 0.1 at 550 nm; 5 uL of this solution wa...
J Med Chem 52: 7142-56 (2009)
Article DOI: 10.1021/jm9011609
BindingDB Entry DOI: 10.7270/Q2222S40