BDBM35583 pyrazolo pyrimidine, 16
SMILES: CNC(=O)Nc1ccc(cc1)-c1nc(N2CCOCC2)c2cnn(C3CCN(CC3)C(=O)NC)c2n1
InChI Key: InChIKey=IYBMOXXTNOCCOV-UHFFFAOYSA-N
Data: 2 IC50
Activity Spreadsheet -- Enzyme Inhibition Constant Data from BindingDB
Found 2 hits for monomerid = 35583
Trg + Lig
Ki
nM
ΔG°
kcal/mole
IC50
nM
Kd
nM
EC50/IC50
nM
koff
s-1
kon
M-1s-1
pHTemp
°C
p110α/p85α
(Homo sapiens (Human))
BDBM35583
(pyrazolo pyrimidine, 16)
Show SMILES CNC(=O)Nc1ccc(cc1)-c1nc(N2CCOCC2)c2cnn(C3CCN(CC3)C(=O)NC)c2n1
Show InChI InChI=1S/C24H31N9O3/c1-25-23(34)28-17-5-3-16(4-6-17)20-29-21(31-11-13-36-14-12-31)19-15-27-33(22(19)30-20)18-7-9-32(10-8-18)24(35)26-2/h3-6,15,18H,7-14H2,1-2H3,(H,26,35)(H2,25,28,34)
n/an/a 149n/an/an/an/an/a25
Wyeth Research
Assay Description
Inhibition of PI3K enzyme activity is measured in a microtiter plate-based fluorescence polarization (FP) assay.
J Med Chem 52: 5013-6 (2009)
Article DOI: 10.1021/jm900851f
BindingDB Entry DOI: 10.7270/Q2SJ1HZD
Serine/threonine-protein kinase mTOR
(Homo sapiens (Human))
BDBM35583
(pyrazolo pyrimidine, 16)
Show SMILES CNC(=O)Nc1ccc(cc1)-c1nc(N2CCOCC2)c2cnn(C3CCN(CC3)C(=O)NC)c2n1
Show InChI InChI=1S/C24H31N9O3/c1-25-23(34)28-17-5-3-16(4-6-17)20-29-21(31-11-13-36-14-12-31)19-15-27-33(22(19)30-20)18-7-9-32(10-8-18)24(35)26-2/h3-6,15,18H,7-14H2,1-2H3,(H,26,35)(H2,25,28,34)
NCI pathway
Reactome pathway
n/an/a 2n/an/an/an/a7.423
Wyeth Research
Assay Description
The enzyme was assayed in DELFIA format using purified FLAG-TOR in kinase buffer containing ATP and His6-S6K in the presence of inhibitor compounds. ...
J Med Chem 52: 5013-6 (2009)
Article DOI: 10.1021/jm900851f
BindingDB Entry DOI: 10.7270/Q2SJ1HZD