null
SMILES: COCC(OC)c1c(NC(=O)Nc2cnc(c(Cl)c2)-n2nccn2)cnc2cc(Cl)nn12
InChI Key: InChIKey=YZAVEKJVVYFZJM-UHFFFAOYSA-N
Activity Spreadsheet -- Enzyme Inhibition Constant Data from BindingDB
Found 2 hits for monomerid = 355932
Trg + Lig
Ki
nM
ΔG°
kcal/mole
IC50
nM
Kd
nM
EC50/IC50
nM
koff
s-1
kon
M-1s-1
pHTemp
°C
Mucosa-associated lymphoid tissue lymphoma translocation protein 1 [329-824]
(Homo sapiens (Human))
BDBM355932
(1-(5-chloro-6-(2H- 1,2,3-triazol-2- yl)pyridin-3-y...)
Show SMILES COCC(OC)c1c(NC(=O)Nc2cnc(c(Cl)c2)-n2nccn2)cnc2cc(Cl)nn12
Show InChI InChI=1S/C18H17Cl2N9O3/c1-31-9-13(32-2)16-12(8-21-15-6-14(20)27-28(15)16)26-18(30)25-10-5-11(19)17(22-7-10)29-23-3-4-24-29/h3-8,13H,9H2,1-2H3,(H2,25,26,30)
NCI pathway
Reactome pathway
US Patent
n/an/a 0.00500n/an/an/an/an/an/a
Novartis AG
US Patent
Assay Description
The assay employs a short peptide substrate labeled with the single fluorophore PT14 as a fluorescence lifetime probe sensitive to the cleavage state...
US Patent US10442808 (2019)
BindingDB Entry DOI: 10.7270/Q2S75JQ3
Mucosa-associated lymphoid tissue lymphoma translocation protein 1
(Homo sapiens (Human))
BDBM355932
(1-(5-chloro-6-(2H- 1,2,3-triazol-2- yl)pyridin-3-y...)
Show SMILES COCC(OC)c1c(NC(=O)Nc2cnc(c(Cl)c2)-n2nccn2)cnc2cc(Cl)nn12
Show InChI InChI=1S/C18H17Cl2N9O3/c1-31-9-13(32-2)16-12(8-21-15-6-14(20)27-28(15)16)26-18(30)25-10-5-11(19)17(22-7-10)29-23-3-4-24-29/h3-8,13H,9H2,1-2H3,(H2,25,26,30)
US Patent
n/an/a 0.00500n/an/an/an/an/an/a
Novartis AG
US Patent
Assay Description
IC50 values of test compounds were determined with an enzyme activity assay using the C-domain of MALT1 (amino acids 329-824). The readout parameter ...
US Patent US9815842 (2017)
BindingDB Entry DOI: 10.7270/Q24F1T0N