BDBM35595 pyrazolo pyrimidine, 28
SMILES: COC(=O)N1CCC(CC1)n1ncc2c(nc(nc12)-c1ccc(NC(=O)Nc2ccc(CO)cc2)cc1)N1CCOCC1
InChI Key: InChIKey=DLIGFKRUAOAIBA-UHFFFAOYSA-N
Data: 2 IC50
Activity Spreadsheet -- Enzyme Inhibition Constant Data from BindingDB
Found 2 hits for monomerid = 35595
Trg + Lig
Ki
nM
ΔG°
kcal/mole
IC50
nM
Kd
nM
EC50/IC50
nM
koff
s-1
kon
M-1s-1
pHTemp
°C
p110α/p85α
(Homo sapiens (Human))
BDBM35595
(pyrazolo pyrimidine, 28)
Show SMILES COC(=O)N1CCC(CC1)n1ncc2c(nc(nc12)-c1ccc(NC(=O)Nc2ccc(CO)cc2)cc1)N1CCOCC1
Show InChI InChI=1S/C30H34N8O5/c1-42-30(41)37-12-10-24(11-13-37)38-28-25(18-31-38)27(36-14-16-43-17-15-36)34-26(35-28)21-4-8-23(9-5-21)33-29(40)32-22-6-2-20(19-39)3-7-22/h2-9,18,24,39H,10-17,19H2,1H3,(H2,32,33,40)
n/an/a 6n/an/an/an/an/a25
Wyeth Research
Assay Description
Inhibition of PI3K enzyme activity is measured in a microtiter plate-based fluorescence polarization (FP) assay.
J Med Chem 52: 5013-6 (2009)
Article DOI: 10.1021/jm900851f
BindingDB Entry DOI: 10.7270/Q2SJ1HZD
Serine/threonine-protein kinase mTOR
(Homo sapiens (Human))
BDBM35595
(pyrazolo pyrimidine, 28)
Show SMILES COC(=O)N1CCC(CC1)n1ncc2c(nc(nc12)-c1ccc(NC(=O)Nc2ccc(CO)cc2)cc1)N1CCOCC1
Show InChI InChI=1S/C30H34N8O5/c1-42-30(41)37-12-10-24(11-13-37)38-28-25(18-31-38)27(36-14-16-43-17-15-36)34-26(35-28)21-4-8-23(9-5-21)33-29(40)32-22-6-2-20(19-39)3-7-22/h2-9,18,24,39H,10-17,19H2,1H3,(H2,32,33,40)
NCI pathway
Reactome pathway
n/an/a 0.0800n/an/an/an/a7.423
Wyeth Research
Assay Description
The enzyme was assayed in DELFIA format using purified FLAG-TOR in kinase buffer containing ATP and His6-S6K in the presence of inhibitor compounds. ...
J Med Chem 52: 5013-6 (2009)
Article DOI: 10.1021/jm900851f
BindingDB Entry DOI: 10.7270/Q2SJ1HZD