BDBM35720 benzazepine derivative, 22
SMILES: Cc1ccccc1C(=O)Nc1ccc(cc1)C(=O)N1CCCC(OCC=C)c2cc(Cl)ccc12
InChI Key: InChIKey=XSEZQCJIHZKQHR-UHFFFAOYSA-N
Data: 2 IC50
Activity Spreadsheet -- Enzyme Inhibition Constant Data from BindingDB
Found 2 hits for monomerid = 35720
Trg + Lig
Ki
nM
ΔG°
kcal/mole
IC50
nM
Kd
nM
EC50/IC50
nM
koff
s-1
kon
M-1s-1
pHTemp
°C
Vasopressin V1a receptor
(Homo sapiens (Human))
BDBM35720
(benzazepine derivative, 22)
Show SMILES Cc1ccccc1C(=O)Nc1ccc(cc1)C(=O)N1CCCC(OCC=C)c2cc(Cl)ccc12
Show InChI InChI=1S/C28H27ClN2O3/c1-3-17-34-26-9-6-16-31(25-15-12-21(29)18-24(25)26)28(33)20-10-13-22(14-11-20)30-27(32)23-8-5-4-7-19(23)2/h3-5,7-8,10-15,18,26H,1,6,9,16-17H2,2H3,(H,30,32)
n/an/a 53n/an/an/an/a7.44
Otsuka Pharmaceutical Co., Ltd
Assay Description
After reaching confluence in 12-well or 24-well dishes, the cells were washed twice with ice-cold PBS and incubated for 2 hr with [3H]-AVP at 4 deg C...
Bioorg Med Chem 7: 1743-54 (1999)
Article DOI: 10.1016/s0968-0896(99)00101-7
BindingDB Entry DOI: 10.7270/Q2W957JR
Vasopressin V2 receptor
(Homo sapiens (Human))
BDBM35720
(benzazepine derivative, 22)
Show SMILES Cc1ccccc1C(=O)Nc1ccc(cc1)C(=O)N1CCCC(OCC=C)c2cc(Cl)ccc12
Show InChI InChI=1S/C28H27ClN2O3/c1-3-17-34-26-9-6-16-31(25-15-12-21(29)18-24(25)26)28(33)20-10-13-22(14-11-20)30-27(32)23-8-5-4-7-19(23)2/h3-5,7-8,10-15,18,26H,1,6,9,16-17H2,2H3,(H,30,32)
n/an/a 9n/an/an/an/a7.44
Otsuka Pharmaceutical Co., Ltd
Assay Description
After reaching confluence in 12-well or 24-well dishes, the cells were washed twice with ice-cold PBS and incubated for 2 hr with [3H]-AVP at 4 deg C...
Bioorg Med Chem 7: 1743-54 (1999)
Article DOI: 10.1016/s0968-0896(99)00101-7
BindingDB Entry DOI: 10.7270/Q2W957JR