null
SMILES: Cn1cc(cn1)-c1ccc2cc([nH]c2c1)C(=O)c1cnn(c1N)-c1ccc2[nH]c(nc2c1)C1CC1
InChI Key: InChIKey=OBQHIGGTXIFTRF-UHFFFAOYSA-N
Activity Spreadsheet -- Enzyme Inhibition Constant Data from BindingDB
Found 4 hits for monomerid = 357252
Trg + Lig
Ki
nM
ΔG°
kcal/mole
IC50
nM
Kd
nM
EC50/IC50
nM
koff
s-1
kon
M-1s-1
pHTemp
°C
Fibroblast growth factor receptor 1
(Homo sapiens (Human))
BDBM357252
((5-Amino-1-(2-cyclopropyl-1H-benzo[d]imidazol-5-yl...)
Show SMILES Cn1cc(cn1)-c1ccc2cc([nH]c2c1)C(=O)c1cnn(c1N)-c1ccc2[nH]c(nc2c1)C1CC1
Show InChI InChI=1S/C26H22N8O/c1-33-13-17(11-28-33)15-4-5-16-9-23(30-21(16)8-15)24(35)19-12-29-34(25(19)27)18-6-7-20-22(10-18)32-26(31-20)14-2-3-14/h4-14,30H,2-3,27H2,1H3,(H,31,32)
NCI pathway
Reactome pathway
US Patent
n/an/a 14n/an/an/an/an/an/a
Zhejiang Hisun Pharmaceutical Co., Ltd.
US Patent
Assay Description
The following assay was used to determine the inhibition rate of the preferred compounds of the present invention to the kinase activity of the recom...
US Patent US10214515 (2019)
BindingDB Entry DOI: 10.7270/Q22J6F46
Fibroblast growth factor receptor 4
(Homo sapiens (Human))
BDBM357252
((5-Amino-1-(2-cyclopropyl-1H-benzo[d]imidazol-5-yl...)
Show SMILES Cn1cc(cn1)-c1ccc2cc([nH]c2c1)C(=O)c1cnn(c1N)-c1ccc2[nH]c(nc2c1)C1CC1
Show InChI InChI=1S/C26H22N8O/c1-33-13-17(11-28-33)15-4-5-16-9-23(30-21(16)8-15)24(35)19-12-29-34(25(19)27)18-6-7-20-22(10-18)32-26(31-20)14-2-3-14/h4-14,30H,2-3,27H2,1H3,(H,31,32)
US Patent
n/an/a 1.00E+3n/an/an/an/an/an/a
Zhejiang Hisun Pharmaceutical Co., Ltd.
US Patent
Assay Description
The following assay was used to determine the inhibition rate of the preferred compounds of the present invention to the kinase activity of the recom...
US Patent US10214515 (2019)
BindingDB Entry DOI: 10.7270/Q22J6F46
Fibroblast growth factor receptor 3
(Homo sapiens (Human))
BDBM357252
((5-Amino-1-(2-cyclopropyl-1H-benzo[d]imidazol-5-yl...)
Show SMILES Cn1cc(cn1)-c1ccc2cc([nH]c2c1)C(=O)c1cnn(c1N)-c1ccc2[nH]c(nc2c1)C1CC1
Show InChI InChI=1S/C26H22N8O/c1-33-13-17(11-28-33)15-4-5-16-9-23(30-21(16)8-15)24(35)19-12-29-34(25(19)27)18-6-7-20-22(10-18)32-26(31-20)14-2-3-14/h4-14,30H,2-3,27H2,1H3,(H,31,32)
Reactome pathway
US Patent
n/an/a 45n/an/an/an/an/an/a
Zhejiang Hisun Pharmaceutical Co., Ltd.
US Patent
Assay Description
The following assay was used to determine the inhibition rate of the preferred compounds of the present invention to the kinase activity of the recom...
US Patent US10214515 (2019)
BindingDB Entry DOI: 10.7270/Q22J6F46
Fibroblast growth factor receptor 2
(Homo sapiens (Human))
BDBM357252
((5-Amino-1-(2-cyclopropyl-1H-benzo[d]imidazol-5-yl...)
Show SMILES Cn1cc(cn1)-c1ccc2cc([nH]c2c1)C(=O)c1cnn(c1N)-c1ccc2[nH]c(nc2c1)C1CC1
Show InChI InChI=1S/C26H22N8O/c1-33-13-17(11-28-33)15-4-5-16-9-23(30-21(16)8-15)24(35)19-12-29-34(25(19)27)18-6-7-20-22(10-18)32-26(31-20)14-2-3-14/h4-14,30H,2-3,27H2,1H3,(H,31,32)
NCI pathway
Reactome pathway
US Patent
n/an/a 2.70n/an/an/an/an/an/a
Zhejiang Hisun Pharmaceutical Co., Ltd.
US Patent
Assay Description
The following assay was used to determine the inhibition rate of the preferred compounds of the present invention to the kinase activity of the recom...
US Patent US10214515 (2019)
BindingDB Entry DOI: 10.7270/Q22J6F46