BDBM357894 US10214536, Compound 76
SMILES: Nc1nc2oc3ccc(cc3c(=O)c2cc1C(O)=O)C1CCS(=O)(=O)CC1
InChI Key: InChIKey=YLXHHSZCWBYDQH-UHFFFAOYSA-N
Data: 3 IC50
PDB links: 1 PDB ID matches this monomer.
Activity Spreadsheet -- Enzyme Inhibition Constant Data from BindingDB
Found 3 hits for monomerid = 357894
Trg + Lig
Ki
nM
ΔG°
kcal/mole
IC50
nM
Kd
nM
EC50/IC50
nM
koff
s-1
kon
M-1s-1
pHTemp
°C
Protein cereblon/Serine/threonine-protein kinase TBK1
(Homo sapiens (Human))
BDBM357894
(US10214536, Compound 76)
Show SMILES Nc1nc2oc3ccc(cc3c(=O)c2cc1C(O)=O)C1CCS(=O)(=O)CC1
Show InChI InChI=1S/C18H16N2O6S/c19-16-13(18(22)23)8-12-15(21)11-7-10(1-2-14(11)26-17(12)20-16)9-3-5-27(24,25)6-4-9/h1-2,7-9H,3-6H2,(H2,19,20)(H,22,23)
US Patent
n/an/a 170n/an/an/an/an/an/a
THE REGENTS OF THE UNIVERSITY OF MICHIGAN
US Patent
Assay Description
Kinase assays are commonly used for determining the ability of a small molecule to inhibit enzyme activity. By measuring the degree of phosphorylatio...
US Patent US10214536 (2019)
BindingDB Entry DOI: 10.7270/Q2N87D2S
3D
3D Structure (crystal)
Protein cereblon/Serine/threonine-protein kinase TBK1
(Homo sapiens (Human))
BDBM357894
(US10214536, Compound 76)
Show SMILES Nc1nc2oc3ccc(cc3c(=O)c2cc1C(O)=O)C1CCS(=O)(=O)CC1
Show InChI InChI=1S/C18H16N2O6S/c19-16-13(18(22)23)8-12-15(21)11-7-10(1-2-14(11)26-17(12)20-16)9-3-5-27(24,25)6-4-9/h1-2,7-9H,3-6H2,(H2,19,20)(H,22,23)
n/an/a 830n/an/an/an/an/an/a
University of Michigan
Curated by ChEMBL
Assay Description
Inhibition of human TBK1 (1 to 657 residues) expressed in Baculovirus infected SF9 insect cells using myelin basic protein as substrate in presence o...
Bioorg Med Chem 26: 5443-5461 (2018)
Article DOI: 10.1016/j.bmc.2018.09.020
BindingDB Entry DOI: 10.7270/Q2M04858
3D
3D Structure (crystal)
Inhibitor of nuclear factor kappa-B kinase subunit epsilon
(Homo sapiens (Human))
BDBM357894
(US10214536, Compound 76)
Show SMILES Nc1nc2oc3ccc(cc3c(=O)c2cc1C(O)=O)C1CCS(=O)(=O)CC1
Show InChI InChI=1S/C18H16N2O6S/c19-16-13(18(22)23)8-12-15(21)11-7-10(1-2-14(11)26-17(12)20-16)9-3-5-27(24,25)6-4-9/h1-2,7-9H,3-6H2,(H2,19,20)(H,22,23)
Reactome pathway
n/an/a 1.10E+4n/an/an/an/an/an/a
University of Michigan
Curated by ChEMBL
Assay Description
Inhibition of human IKKepsilon (1 to 655 residues) expressed in Baculovirus infected SF9 insect cells using myelin basic protein as substrate in pres...
Bioorg Med Chem 26: 5443-5461 (2018)
Article DOI: 10.1016/j.bmc.2018.09.020
BindingDB Entry DOI: 10.7270/Q2M04858