null
SMILES: CC(C)c1ccc2oc3nc(N)c(cc3c(=O)c2c1)C(=O)Nc1nnn[nH]1
InChI Key: InChIKey=JDIHMNISRGRMDY-UHFFFAOYSA-N
PDB links: 1 PDB ID matches this monomer.
Activity Spreadsheet -- Enzyme Inhibition Constant Data from BindingDB
Found 1 hit for monomerid = 357921
Trg + Lig
Ki
nM
ΔG°
kcal/mole
IC50
nM
Kd
nM
EC50/IC50
nM
koff
s-1
kon
M-1s-1
pHTemp
°C
Serine/threonine-protein kinase TBK1
(Homo sapiens (Human))
BDBM357921
(US10214536, Compound 288)
Show SMILES CC(C)c1ccc2oc3nc(N)c(cc3c(=O)c2c1)C(=O)Nc1nnn[nH]1
Show InChI InChI=1S/C17H15N7O3/c1-7(2)8-3-4-12-9(5-8)13(25)10-6-11(14(18)19-16(10)27-12)15(26)20-17-21-23-24-22-17/h3-7H,1-2H3,(H2,18,19)(H2,20,21,22,23,24,26)
US Patent
n/an/a 180n/an/an/an/an/an/a
THE REGENTS OF THE UNIVERSITY OF MICHIGAN
US Patent
Assay Description
Kinase assays are commonly used for determining the ability of a small molecule to inhibit enzyme activity. By measuring the degree of phosphorylatio...
US Patent US10214536 (2019)
BindingDB Entry DOI: 10.7270/Q2N87D2S
3D
3D Structure (crystal)