null
SMILES: CC(=O)N1CCN(C(=O)C1(C)C)c1cccc(c1)-c1cc(-c2cnn(c2)S(C)(=O)=O)c2c(N)ncnn12
InChI Key: InChIKey=DLPASQQBTGWHHU-UHFFFAOYSA-N
Activity Spreadsheet -- Enzyme Inhibition Constant Data from BindingDB
Found 1 hit for monomerid = 358358
Trg + Lig
Ki
nM
ΔG°
kcal/mole
IC50
nM
Kd
nM
EC50/IC50
nM
koff
s-1
kon
M-1s-1
pHTemp
°C
Phosphatidylinositol 4,5-bisphosphate 3-kinase catalytic subunit delta isoform
(Homo sapiens (Human))
BDBM358358
(4-acetyl-1-{3-[4-amino-5-(1- methanesulfonyl-1H-py...)
Show SMILES CC(=O)N1CCN(C(=O)C1(C)C)c1cccc(c1)-c1cc(-c2cnn(c2)S(C)(=O)=O)c2c(N)ncnn12
Show InChI InChI=1S/C24H26N8O4S/c1-15(33)30-9-8-29(23(34)24(30,2)3)18-7-5-6-16(10-18)20-11-19(21-22(25)26-14-28-32(20)21)17-12-27-31(13-17)37(4,35)36/h5-7,10-14H,8-9H2,1-4H3,(H2,25,26,28)
NCI pathway
Reactome pathway
US Patent
n/an/a 0.5n/an/an/an/an/an/a
Bristol-Myers Squibb Company
US Patent
Assay Description
The ADP-Glo format PI3K assays were performed in Proxiplate 384-well plates (Perkin Elmer #6008280). The final assay volume was 2 μl prepared fr...
US Patent US10214537 (2019)
BindingDB Entry DOI: 10.7270/Q2HH6NB2