null
SMILES: C[C@H]1CN(C(C)=O)C(C)(C)C(=O)N1c1cc(ccc1F)-c1cc(-c2ccnn2C(C(F)(F)F)C(F)(F)F)c2c(N)ncnn12
InChI Key: InChIKey=OBFKYUBLRXZDIH-ZDUSSCGKSA-N
Activity Spreadsheet -- Enzyme Inhibition Constant Data from BindingDB
Found 1 hit for monomerid = 358604
Trg + Lig
Ki
nM
ΔG°
kcal/mole
IC50
nM
Kd
nM
EC50/IC50
nM
koff
s-1
kon
M-1s-1
pHTemp
°C
Phosphatidylinositol 4,5-bisphosphate 3-kinase catalytic subunit delta isoform
(Homo sapiens (Human))
BDBM358604
((S)-4-acetyl-1-(5-(4-amino-5-(1-((S)- 1,1,1-triflu...)
Show SMILES C[C@H]1CN(C(C)=O)C(C)(C)C(=O)N1c1cc(ccc1F)-c1cc(-c2ccnn2C(C(F)(F)F)C(F)(F)F)c2c(N)ncnn12 |r|
Show InChI InChI=1S/C27H25F7N8O2/c1-13-11-39(14(2)43)25(3,4)24(44)40(13)20-9-15(5-6-17(20)28)19-10-16(21-22(35)36-12-38-41(19)21)18-7-8-37-42(18)23(26(29,30)31)27(32,33)34/h5-10,12-13,23H,11H2,1-4H3,(H2,35,36,38)/t13-/m0/s1
NCI pathway
Reactome pathway
US Patent
n/an/a 0.200n/an/an/an/an/an/a
Bristol-Myers Squibb Company
US Patent
Assay Description
The ADP-Glo format PI3K assays were performed in Proxiplate 384-well plates (Perkin Elmer #6008280). The final assay volume was 2 μl prepared fr...
US Patent US10214537 (2019)
BindingDB Entry DOI: 10.7270/Q2HH6NB2