null
SMILES: C[C@H]1CN(C(C)=O)C(C)(C)C(=O)N1c1cc(ccc1F)-c1cc(C#N)c2c(N)ncnn12
InChI Key: InChIKey=RMJDHMBGJKUPQX-LBPRGKRZSA-N
Activity Spreadsheet -- Enzyme Inhibition Constant Data from BindingDB
Found 1 hit for monomerid = 358605
Trg + Lig
Ki
nM
ΔG°
kcal/mole
IC50
nM
Kd
nM
EC50/IC50
nM
koff
s-1
kon
M-1s-1
pHTemp
°C
Phosphatidylinositol 4,5-bisphosphate 3-kinase catalytic subunit delta isoform
(Homo sapiens (Human))
BDBM358605
((S)-7-(3-(4-acetyl-3,3,6-trimethyl-2- oxopiperazin...)
Show SMILES C[C@H]1CN(C(C)=O)C(C)(C)C(=O)N1c1cc(ccc1F)-c1cc(C#N)c2c(N)ncnn12 |r|
Show InChI InChI=1S/C22H22FN7O2/c1-12-10-28(13(2)31)22(3,4)21(32)29(12)18-7-14(5-6-16(18)23)17-8-15(9-24)19-20(25)26-11-27-30(17)19/h5-8,11-12H,10H2,1-4H3,(H2,25,26,27)/t12-/m0/s1
NCI pathway
Reactome pathway
US Patent
n/an/a 0.400n/an/an/an/an/an/a
Bristol-Myers Squibb Company
US Patent
Assay Description
The ADP-Glo format PI3K assays were performed in Proxiplate 384-well plates (Perkin Elmer #6008280). The final assay volume was 2 μl prepared fr...
US Patent US10214537 (2019)
BindingDB Entry DOI: 10.7270/Q2HH6NB2