BDBM35949 4-pyridinoxy-2-anilinopyridine-based compound, 13
SMILES: Cc1cc(Oc2ccnc(Nc3cccc(c3)N3CCOCC3)c2)c(nc1C)-c1ccccn1
InChI Key: InChIKey=VTKXXNOAGGALPW-UHFFFAOYSA-N
Data: 1 IC50  1 EC50
Activity Spreadsheet -- Enzyme Inhibition Constant Data from BindingDB
Found 1 hit for monomerid = 35949
Trg + Lig
Ki
nM
ΔG°
kcal/mole
IC50
nM
Kd
nM
EC50/IC50
nM
koff
s-1
kon
M-1s-1
pHTemp
°C
TGF-beta receptor type-1
(Homo sapiens (Human))
BDBM35949
(4-pyridinoxy-2-anilinopyridine-based compound, 13)
Show SMILES Cc1cc(Oc2ccnc(Nc3cccc(c3)N3CCOCC3)c2)c(nc1C)-c1ccccn1
Show InChI InChI=1S/C27H27N5O2/c1-19-16-25(27(30-20(19)2)24-8-3-4-10-28-24)34-23-9-11-29-26(18-23)31-21-6-5-7-22(17-21)32-12-14-33-15-13-32/h3-11,16-18H,12-15H2,1-2H3,(H,29,31)
n/an/a 6n/a 62n/an/a7.423
AstraZeneca
Assay Description
A fluorescence polarization assay was used to assess the ALK5 binding capacity and biochemical activity of compounds. ALK5 protein was added to each ...
J Med Chem 52: 7901-5 (2009)
Article DOI: 10.1021/jm900807w
BindingDB Entry DOI: 10.7270/Q2KS6PXG