null
SMILES: COC1CN(C1)C(=O)C1CCc2c(C1)n(nc2-c1ccc(cc1F)C(O)=O)C(=O)c1c(Cl)cccc1C1(CC1)C(F)(F)F
InChI Key: InChIKey=JPHAUQHBKNEEGF-UHFFFAOYSA-N
Activity Spreadsheet -- Enzyme Inhibition Constant Data from BindingDB
Found 1 hit for monomerid = 359539
Trg + Lig
Ki
nM
ΔG°
kcal/mole
IC50
nM
Kd
nM
EC50/IC50
nM
koff
s-1
kon
M-1s-1
pHTemp
°C
Nuclear receptor ROR-gamma
(Homo sapiens (Human))
BDBM359539
(4-{(6R or S)-1-({2- chloro-6-[1- (trifluoromethyl...)
Show SMILES COC1CN(C1)C(=O)C1CCc2c(C1)n(nc2-c1ccc(cc1F)C(O)=O)C(=O)c1c(Cl)cccc1C1(CC1)C(F)(F)F
Show InChI InChI=1S/C30H26ClF4N3O5/c1-43-17-13-37(14-17)26(39)15-5-8-19-23(12-15)38(36-25(19)18-7-6-16(28(41)42)11-22(18)32)27(40)24-20(3-2-4-21(24)31)29(9-10-29)30(33,34)35/h2-4,6-7,11,15,17H,5,8-10,12-14H2,1H3,(H,41,42)
US Patent
n/an/a 0.800n/an/an/an/an/an/a
Merck Sharp & Dohme Corp.
US Patent
Assay Description
The compounds of the invention inhibit RORgammaT activity. Activation of RORgammaT activity can be measured using, e.g., biochemical TR-FRET assay. I...
US Patent US10221142 (2019)
BindingDB Entry DOI: 10.7270/Q2M90BZ0