null
SMILES: OC(=O)c1ccc(-c2nn(C(=O)c3c(Cl)cccc3C3(CC3)C(F)(F)F)c3CC(CCc23)C(=O)N2CCC3(CCCO3)C2)c(F)c1
InChI Key: InChIKey=VZRVXYMKBSWUDA-UHFFFAOYSA-N
Activity Spreadsheet -- Enzyme Inhibition Constant Data from BindingDB
Found 1 hit for monomerid = 359543
Trg + Lig
Ki
nM
ΔG°
kcal/mole
IC50
nM
Kd
nM
EC50/IC50
nM
koff
s-1
kon
M-1s-1
pHTemp
°C
Nuclear receptor ROR-gamma
(Homo sapiens (Human))
BDBM359543
(4-[(6R or S)-1-({2- chloro-6-[1- (trifluoromethyl)...)
Show SMILES OC(=O)c1ccc(-c2nn(C(=O)c3c(Cl)cccc3C3(CC3)C(F)(F)F)c3CC(CCc23)C(=O)N2CCC3(CCCO3)C2)c(F)c1
Show InChI InChI=1S/C33H30ClF4N3O5/c34-23-4-1-3-22(32(10-11-32)33(36,37)38)26(23)29(43)41-25-16-18(28(42)40-13-12-31(17-40)9-2-14-46-31)5-8-21(25)27(39-41)20-7-6-19(30(44)45)15-24(20)35/h1,3-4,6-7,15,18H,2,5,8-14,16-17H2,(H,44,45)
US Patent
n/an/a 0.600n/an/an/an/an/an/a
Merck Sharp & Dohme Corp.
US Patent
Assay Description
The compounds of the invention inhibit RORgammaT activity. Activation of RORgammaT activity can be measured using, e.g., biochemical TR-FRET assay. I...
US Patent US10221142 (2019)
BindingDB Entry DOI: 10.7270/Q2M90BZ0