BDBM359547 4-[(6R or S)-1-({2- chloro-6-[1- (trifluoromethyl)cyclo- propyl]phenyl}car- bonyl)-6-{[4- (dimethylamino)-3,3- difluoropyrrolidin-1- yl]carbonyl}-4,5,6,7- tetrahydro-1H- indazol-3-yl]-3- fluorobenzoic acid::US10221142, Example 21M
SMILES: CN(C)C1CN(CC1(F)F)C(=O)C1CCc2c(C1)n(nc2-c1ccc(cc1F)C(O)=O)C(=O)c1c(Cl)cccc1C1(CC1)C(F)(F)F
InChI Key: InChIKey=GGDNZRMOQGUVOK-UHFFFAOYSA-N
Data: 1 IC50
Activity Spreadsheet -- Enzyme Inhibition Constant Data from BindingDB
Found 1 hit for monomerid = 359547
Trg + Lig
Ki
nM
ΔG°
kcal/mole
IC50
nM
Kd
nM
EC50/IC50
nM
koff
s-1
kon
M-1s-1
pHTemp
°C
Nuclear receptor ROR-gamma (RORC)
(Homo sapiens (Human))
BDBM359547
(4-[(6R or S)-1-({2- chloro-6-[1- (trifluoromethyl)...)
Show SMILES CN(C)C1CN(CC1(F)F)C(=O)C1CCc2c(C1)n(nc2-c1ccc(cc1F)C(O)=O)C(=O)c1c(Cl)cccc1C1(CC1)C(F)(F)F
Show InChI InChI=1S/C32H29ClF6N4O4/c1-41(2)24-14-42(15-31(24,35)36)27(44)16-6-9-19-23(13-16)43(40-26(19)18-8-7-17(29(46)47)12-22(18)34)28(45)25-20(4-3-5-21(25)33)30(10-11-30)32(37,38)39/h3-5,7-8,12,16,24H,6,9-11,13-15H2,1-2H3,(H,46,47)
US Patent
n/an/a 0.700n/an/an/an/an/an/a
Merck Sharp & Dohme Corp.
US Patent
Assay Description
The compounds of the invention inhibit RORgammaT activity. Activation of RORgammaT activity can be measured using, e.g., biochemical TR-FRET assay. I...
US Patent US10221142 (2019)
BindingDB Entry DOI: 10.7270/Q2M90BZ0