BDBM359579 (R or S)-4-(1-(2- chloro-6-(1- (trifluoromethyl)cyclo- propyl)benzoyl)-6- ((2- methoxyethyl)(methyl) carbamoyl)-4,5,6,7- tetrahydro-1H- indazol-3-yl)-3- fluorobenzoic acid::US10221142, Example 21TT
SMILES: COCCN(C)C(=O)C1CCc2c(C1)n(nc2-c1ccc(cc1F)C(O)=O)C(=O)c1c(Cl)cccc1C1(CC1)C(F)(F)F
InChI Key: InChIKey=WBJRJFTWAWTXPI-UHFFFAOYSA-N
Data: 1 IC50
Activity Spreadsheet -- Enzyme Inhibition Constant Data from BindingDB
Found 1 hit for monomerid = 359579
Trg + Lig
Ki
nM
ΔG°
kcal/mole
IC50
nM
Kd
nM
EC50/IC50
nM
koff
s-1
kon
M-1s-1
pHTemp
°C
Nuclear receptor ROR-gamma (RORC)
(Homo sapiens (Human))
BDBM359579
((R or S)-4-(1-(2- chloro-6-(1- (trifluoromethyl)cy...)
Show SMILES COCCN(C)C(=O)C1CCc2c(C1)n(nc2-c1ccc(cc1F)C(O)=O)C(=O)c1c(Cl)cccc1C1(CC1)C(F)(F)F
Show InChI InChI=1S/C30H28ClF4N3O5/c1-37(12-13-43-2)26(39)16-6-9-19-23(15-16)38(36-25(19)18-8-7-17(28(41)42)14-22(18)32)27(40)24-20(4-3-5-21(24)31)29(10-11-29)30(33,34)35/h3-5,7-8,14,16H,6,9-13,15H2,1-2H3,(H,41,42)
US Patent
n/an/a 1n/an/an/an/an/an/a
Merck Sharp & Dohme Corp.
US Patent
Assay Description
The compounds of the invention inhibit RORgammaT activity. Activation of RORgammaT activity can be measured using, e.g., biochemical TR-FRET assay. I...
US Patent US10221142 (2019)
BindingDB Entry DOI: 10.7270/Q2M90BZ0