BDBM3604 4-N-(3-bromophenyl)-6-N,6-N-dimethylpyrido[3,4-d]pyrimidine-4,6-diamine::4-[(3-bromophenyl)-amino]-6-(dimethylamino)pyrido[3,4-d]pyrimidine::CHEMBL53711::Pyrido[3,4-d]pyrimidine 7g
SMILES: CN(C)c1cc2c(Nc3cccc(Br)c3)ncnc2cn1
InChI Key: InChIKey=QFXMHNZCUIIRHD-UHFFFAOYSA-N
Data: 2 IC50
Activity Spreadsheet -- Enzyme Inhibition Constant Data from BindingDB
Found 2 hits for monomerid = 3604
Trg + Lig
Ki
nM
ΔG°
kcal/mole
IC50
nM
Kd
nM
EC50/IC50
nM
koff
s-1
kon
M-1s-1
pHTemp
°C
Epidermal growth factor receptor
(Homo sapiens (Human))
BDBM3604
(4-N-(3-bromophenyl)-6-N,6-N-dimethylpyrido[3,4-d]p...)
Show SMILES CN(C)c1cc2c(Nc3cccc(Br)c3)ncnc2cn1
Show InChI InChI=1S/C15H14BrN5/c1-21(2)14-7-12-13(8-17-14)18-9-19-15(12)20-11-5-3-4-10(16)6-11/h3-9H,1-2H3,(H,18,19,20)
n/an/a 0.00600n/an/an/an/a7.422
University of Auckland
Assay Description
IC50 is the inhibitor concentration which inhibits 50% of kinase activity that catalyzes the transfer of the terminal phosphate from [gamma-32P] labe...
J Med Chem 41: 742-51 (1998)
Article DOI: 10.1021/jm970641d
BindingDB Entry DOI: 10.7270/Q2DB800T
Epidermal growth factor receptor
(Homo sapiens (Human))
BDBM3604
(4-N-(3-bromophenyl)-6-N,6-N-dimethylpyrido[3,4-d]p...)
Show SMILES CN(C)c1cc2c(Nc3cccc(Br)c3)ncnc2cn1
Show InChI InChI=1S/C15H14BrN5/c1-21(2)14-7-12-13(8-17-14)18-9-19-15(12)20-11-5-3-4-10(16)6-11/h3-9H,1-2H3,(H,18,19,20)
n/an/a 0.00600n/an/an/an/a7.422
University of Auckland
Assay Description
IC50 is the inhibitor concentration which inhibits 50% of kinase activity that catalyzes the transfer of the terminal phosphate from [gamma-32P] labe...
J Med Chem 39: 1823-35 (1996)
Article DOI: 10.1021/jm9508651
BindingDB Entry DOI: 10.7270/Q2X928GF