BDBM361124 (R)-4-(2-methyl-2H- benzo[d][1,2,3]triazol-4- yl)-N1-(pyrrolidin-3-yl)- 3-(2H-tetrazol-5- yl)benzene-1,2- disulfonamide::US10221163, Example 281::US10544130, Example 281
SMILES: Cn1nc2cccc(-c3ccc(c(c3-c3nn[nH]n3)S(N)(=O)=O)S(=O)(=O)N[C@@H]3CCNC3)c2n1
InChI Key:
Data: 6 IC50
Activity Spreadsheet -- Enzyme Inhibition Constant Data from BindingDB
Found 6 hits for monomerid = 361124
Trg + Lig
Ki
nM
ΔG°
kcal/mole
IC50
nM
Kd
nM
EC50/IC50
nM
koff
s-1
kon
M-1s-1
pHTemp
°C
Metallo-beta-lactamase type 2
(Serratia marcescens)
BDBM361124
((R)-4-(2-methyl-2H- benzo[d][1,2,3]triazol-4- yl)-...)
Show SMILES Cn1nc2cccc(-c3ccc(c(c3-c3nn[nH]n3)S(N)(=O)=O)S(=O)(=O)N[C@@H]3CCNC3)c2n1 |r|
US Patent
n/an/a 0.75n/an/an/an/an/an/a
Merck Sharp & Dohme Corp.
US Patent
Assay Description
The Class B enzyme activities were measured in the presence of the test inhibitor in a fluorescence assay against a commercially available substrate ...
US Patent US10221163 (2019)
BindingDB Entry DOI: 10.7270/Q2RX9FB1
Beta-lactamase NDM-1
(Klebsiella pneumoniae)
BDBM361124
((R)-4-(2-methyl-2H- benzo[d][1,2,3]triazol-4- yl)-...)
Show SMILES Cn1nc2cccc(-c3ccc(c(c3-c3nn[nH]n3)S(N)(=O)=O)S(=O)(=O)N[C@@H]3CCNC3)c2n1 |r|
US Patent
n/an/a 0.0170n/an/an/an/an/an/a
Merck Sharp & Dohme Corp.
US Patent
Assay Description
The Class B enzyme activities were measured in the presence of the test inhibitor in a fluorescence assay against a commercially available substrate ...
US Patent US10221163 (2019)
BindingDB Entry DOI: 10.7270/Q2RX9FB1
Beta-lactamase
()
BDBM361124
((R)-4-(2-methyl-2H- benzo[d][1,2,3]triazol-4- yl)-...)
Show SMILES Cn1nc2cccc(-c3ccc(c(c3-c3nn[nH]n3)S(N)(=O)=O)S(=O)(=O)N[C@@H]3CCNC3)c2n1 |r|
US Patent
n/an/a 0.0520n/an/an/an/an/an/a
Merck Sharp & Dohme Corp.
US Patent
US Patent US10544130 (2020)
BindingDB Entry DOI: 10.7270/Q2C82CQH
Metallo-beta-lactamase type 2
(Serratia marcescens)
BDBM361124
((R)-4-(2-methyl-2H- benzo[d][1,2,3]triazol-4- yl)-...)
Show SMILES Cn1nc2cccc(-c3ccc(c(c3-c3nn[nH]n3)S(N)(=O)=O)S(=O)(=O)N[C@@H]3CCNC3)c2n1 |r|
US Patent
n/an/a 0.75n/an/an/an/an/an/a
Merck Sharp & Dohme Corp.
US Patent
Assay Description
The Class B enzyme activities were measured in the presence of the test inhibitor in a fluorescence assay against a commercially available substrate ...
US Patent US10544130 (2020)
BindingDB Entry DOI: 10.7270/Q2C82CQH
Beta-lactamase NDM-1
(Klebsiella pneumoniae)
BDBM361124
((R)-4-(2-methyl-2H- benzo[d][1,2,3]triazol-4- yl)-...)
Show SMILES Cn1nc2cccc(-c3ccc(c(c3-c3nn[nH]n3)S(N)(=O)=O)S(=O)(=O)N[C@@H]3CCNC3)c2n1 |r|
US Patent
n/an/a 0.0170n/an/an/an/an/an/a
Merck Sharp & Dohme Corp.
US Patent
US Patent US10544130 (2020)
BindingDB Entry DOI: 10.7270/Q2C82CQH
Beta-lactamase VIM-1
(Klebsiella pneumoniae)
BDBM361124
((R)-4-(2-methyl-2H- benzo[d][1,2,3]triazol-4- yl)-...)
Show SMILES Cn1nc2cccc(-c3ccc(c(c3-c3nn[nH]n3)S(N)(=O)=O)S(=O)(=O)N[C@@H]3CCNC3)c2n1 |r|
US Patent
n/an/a 0.0520n/an/an/an/an/an/a
Merck Sharp & Dohme Corp.
US Patent
Assay Description
The Class B enzyme activities were measured in the presence of the test inhibitor in a fluorescence assay against a commercially available substrate ...
US Patent US10221163 (2019)
BindingDB Entry DOI: 10.7270/Q2RX9FB1