BDBM361172 4-(2-Amino-7-methyl-1H-benzo[d]imidazol-4-yl)-N1-(2-aminoethyl)-3-(2H-tetrazol-5-yl)benzene-1,2-disulfonamide::US10221163, Example 329::US10544130, Example 329
SMILES: Cc1ccc(-c2ccc(c(c2-c2nn[nH]n2)S(N)(=O)=O)S(=O)(=O)NCCN)c2nc(N)[nH]c12
InChI Key: InChIKey=RQPNOZBYGYYABS-UHFFFAOYSA-N
Data: 6 IC50
Activity Spreadsheet -- Enzyme Inhibition Constant Data from BindingDB
Found 6 hits for monomerid = 361172
Trg + Lig
Ki
nM
ΔG°
kcal/mole
IC50
nM
Kd
nM
EC50/IC50
nM
koff
s-1
kon
M-1s-1
pHTemp
°C
Metallo-beta-lactamase type 2
(Serratia marcescens)
BDBM361172
(4-(2-Amino-7-methyl-1H-benzo[d]imidazol-4-yl)-N1-(...)
Show SMILES Cc1ccc(-c2ccc(c(c2-c2nn[nH]n2)S(N)(=O)=O)S(=O)(=O)NCCN)c2nc(N)[nH]c12
Show InChI InChI=1S/C17H20N10O4S2/c1-8-2-3-10(14-13(8)22-17(19)23-14)9-4-5-11(33(30,31)21-7-6-18)15(32(20,28)29)12(9)16-24-26-27-25-16/h2-5,21H,6-7,18H2,1H3,(H3,19,22,23)(H2,20,28,29)(H,24,25,26,27)
US Patent
n/an/a 0.128n/an/an/an/an/an/a
Merck Sharp & Dohme Corp.
US Patent
Assay Description
The Class B enzyme activities were measured in the presence of the test inhibitor in a fluorescence assay against a commercially available substrate ...
US Patent US10221163 (2019)
BindingDB Entry DOI: 10.7270/Q2RX9FB1
Beta-lactamase NDM-1
(Klebsiella pneumoniae)
BDBM361172
(4-(2-Amino-7-methyl-1H-benzo[d]imidazol-4-yl)-N1-(...)
Show SMILES Cc1ccc(-c2ccc(c(c2-c2nn[nH]n2)S(N)(=O)=O)S(=O)(=O)NCCN)c2nc(N)[nH]c12
Show InChI InChI=1S/C17H20N10O4S2/c1-8-2-3-10(14-13(8)22-17(19)23-14)9-4-5-11(33(30,31)21-7-6-18)15(32(20,28)29)12(9)16-24-26-27-25-16/h2-5,21H,6-7,18H2,1H3,(H3,19,22,23)(H2,20,28,29)(H,24,25,26,27)
US Patent
n/an/a 0.0150n/an/an/an/an/an/a
Merck Sharp & Dohme Corp.
US Patent
Assay Description
The Class B enzyme activities were measured in the presence of the test inhibitor in a fluorescence assay against a commercially available substrate ...
US Patent US10221163 (2019)
BindingDB Entry DOI: 10.7270/Q2RX9FB1
Beta-lactamase
()
BDBM361172
(4-(2-Amino-7-methyl-1H-benzo[d]imidazol-4-yl)-N1-(...)
Show SMILES Cc1ccc(-c2ccc(c(c2-c2nn[nH]n2)S(N)(=O)=O)S(=O)(=O)NCCN)c2nc(N)[nH]c12
Show InChI InChI=1S/C17H20N10O4S2/c1-8-2-3-10(14-13(8)22-17(19)23-14)9-4-5-11(33(30,31)21-7-6-18)15(32(20,28)29)12(9)16-24-26-27-25-16/h2-5,21H,6-7,18H2,1H3,(H3,19,22,23)(H2,20,28,29)(H,24,25,26,27)
US Patent
n/an/a 0.0430n/an/an/an/an/an/a
Merck Sharp & Dohme Corp.
US Patent
US Patent US10544130 (2020)
BindingDB Entry DOI: 10.7270/Q2C82CQH
Metallo-beta-lactamase type 2
(Serratia marcescens)
BDBM361172
(4-(2-Amino-7-methyl-1H-benzo[d]imidazol-4-yl)-N1-(...)
Show SMILES Cc1ccc(-c2ccc(c(c2-c2nn[nH]n2)S(N)(=O)=O)S(=O)(=O)NCCN)c2nc(N)[nH]c12
Show InChI InChI=1S/C17H20N10O4S2/c1-8-2-3-10(14-13(8)22-17(19)23-14)9-4-5-11(33(30,31)21-7-6-18)15(32(20,28)29)12(9)16-24-26-27-25-16/h2-5,21H,6-7,18H2,1H3,(H3,19,22,23)(H2,20,28,29)(H,24,25,26,27)
US Patent
n/an/a 0.128n/an/an/an/an/an/a
Merck Sharp & Dohme Corp.
US Patent
Assay Description
The Class B enzyme activities were measured in the presence of the test inhibitor in a fluorescence assay against a commercially available substrate ...
US Patent US10544130 (2020)
BindingDB Entry DOI: 10.7270/Q2C82CQH
Beta-lactamase NDM-1
(Klebsiella pneumoniae)
BDBM361172
(4-(2-Amino-7-methyl-1H-benzo[d]imidazol-4-yl)-N1-(...)
Show SMILES Cc1ccc(-c2ccc(c(c2-c2nn[nH]n2)S(N)(=O)=O)S(=O)(=O)NCCN)c2nc(N)[nH]c12
Show InChI InChI=1S/C17H20N10O4S2/c1-8-2-3-10(14-13(8)22-17(19)23-14)9-4-5-11(33(30,31)21-7-6-18)15(32(20,28)29)12(9)16-24-26-27-25-16/h2-5,21H,6-7,18H2,1H3,(H3,19,22,23)(H2,20,28,29)(H,24,25,26,27)
US Patent
n/an/a 0.0150n/an/an/an/an/an/a
Merck Sharp & Dohme Corp.
US Patent
US Patent US10544130 (2020)
BindingDB Entry DOI: 10.7270/Q2C82CQH
Beta-lactamase VIM-1
(Klebsiella pneumoniae)
BDBM361172
(4-(2-Amino-7-methyl-1H-benzo[d]imidazol-4-yl)-N1-(...)
Show SMILES Cc1ccc(-c2ccc(c(c2-c2nn[nH]n2)S(N)(=O)=O)S(=O)(=O)NCCN)c2nc(N)[nH]c12
Show InChI InChI=1S/C17H20N10O4S2/c1-8-2-3-10(14-13(8)22-17(19)23-14)9-4-5-11(33(30,31)21-7-6-18)15(32(20,28)29)12(9)16-24-26-27-25-16/h2-5,21H,6-7,18H2,1H3,(H3,19,22,23)(H2,20,28,29)(H,24,25,26,27)
US Patent
n/an/a 0.0430n/an/an/an/an/an/a
Merck Sharp & Dohme Corp.
US Patent
Assay Description
The Class B enzyme activities were measured in the presence of the test inhibitor in a fluorescence assay against a commercially available substrate ...
US Patent US10221163 (2019)
BindingDB Entry DOI: 10.7270/Q2RX9FB1