BDBM36161 D-phenylalanine
SMILES: N[C@H](Cc1ccccc1)C(O)=O
InChI Key: InChIKey=COLNVLDHVKWLRT-MRVPVSSYSA-N
Data: 1 IC50  1 ITC
PDB links: 143 PDB IDs match this monomer.
Activity Spreadsheet -- Enzyme Inhibition Constant Data from BindingDB
Found 1 hit for monomerid = 36161
Trg + Lig
Ki
nM
ΔG°
kcal/mole
IC50
nM
Kd
nM
EC50/IC50
nM
koff
s-1
kon
M-1s-1
pHTemp
°C
Large neutral amino acids transporter small subunit 1
(Homo sapiens (Human))
BDBM36161
(D-phenylalanine)
Show SMILES N[C@H](Cc1ccccc1)C(O)=O
Show InChI InChI=1S/C9H11NO2/c10-8(9(11)12)6-7-4-2-1-3-5-7/h1-5,8H,6,10H2,(H,11,12)/t8-/m1/s1
n/an/a 4.60E+4n/an/an/an/an/an/a
University of California
Curated by ChEMBL
Assay Description
Cis-inhibition of human LAT1 expressed in TREx HEK293 cells at 200 uM assessed as inhibition of [3H]-gabapentin uptake preincubated for 3 mins at 37 ...
J Med Chem 61: 7358-7373 (2018)
Article DOI: 10.1021/acs.jmedchem.8b01007
BindingDB Entry DOI: 10.7270/Q2XK8J66
Activity Spreadsheet -- ITC Data from BindingDB
Found 1 hit for monomerid = 36161
Cell (A)Syringe (B)Cell
Syringe
Cell + Syr
ΔG°
kcal/mole
-TΔS°
kcal/mole
ΔH°
kcal/mole
log KpHTemp
°C
BDBM4
JPEG
BDBM36161
JPEG
-1.242.35-3.580.9035.0125
NIST
J Phys Chem 98: 10282-10288 (1994)