BDBM361752 US10221177, Compound 115
SMILES: C[C@@H](C(=O)Nc1cccc(n1)-c1cnc(nc1)N1CCC[C@H]1C(F)(F)F)n1cnc2n(C)c(=O)n(Cc3cc(C)on3)c(=O)c12
InChI Key: InChIKey=SELZLURRXNIGSN-JXFKEZNVSA-N
Data: 1 IC50
Activity Spreadsheet -- Enzyme Inhibition Constant Data from BindingDB
Found 1 hit for monomerid = 361752
Trg + Lig
Ki
nM
ΔG°
kcal/mole
IC50
nM
Kd
nM
EC50/IC50
nM
koff
s-1
kon
M-1s-1
pHTemp
°C
Transient receptor potential cation channel subfamily A member 1
(Homo sapiens (Human))
BDBM361752
(US10221177, Compound 115)
Show SMILES C[C@@H](C(=O)Nc1cccc(n1)-c1cnc(nc1)N1CCC[C@H]1C(F)(F)F)n1cnc2n(C)c(=O)n(Cc3cc(C)on3)c(=O)c12 |r|
Show InChI InChI=1S/C28H27F3N10O4/c1-15-10-18(37-45-15)13-40-25(43)22-23(38(3)27(40)44)34-14-41(22)16(2)24(42)36-21-8-4-6-19(35-21)17-11-32-26(33-12-17)39-9-5-7-20(39)28(29,30)31/h4,6,8,10-12,14,16,20H,5,7,9,13H2,1-3H3,(H,35,36,42)/t16-,20-/m0/s1
US Patent
n/an/a 1n/an/an/an/an/an/a
Hydra Biosciences, Inc.
US Patent
Assay Description
Compounds of Formula (I) inhibit the TRPA1 channel, as shown by measuring the in vitro inhibition of human TRPA1, provided in data tables shown in Ta...
US Patent US10221177 (2019)
BindingDB Entry DOI: 10.7270/Q2445PR8