null
SMILES: C[C@@H](C(=O)Nc1ccnc(n1)-c1cnc(C)c(c1)C(F)(F)F)n1cnc2n(C)c(=O)n(Cc3noc(C)n3)c(=O)c12
InChI Key: InChIKey=AVISJIJTLXTWET-LBPRGKRZSA-N
Activity Spreadsheet -- Enzyme Inhibition Constant Data from BindingDB
Found 1 hit for monomerid = 361807
Trg + Lig
Ki
nM
ΔG°
kcal/mole
IC50
nM
Kd
nM
EC50/IC50
nM
koff
s-1
kon
M-1s-1
pHTemp
°C
Transient receptor potential cation channel subfamily A member 1
(Homo sapiens (Human))
BDBM361807
(US10221177, Compound 172)
Show SMILES C[C@@H](C(=O)Nc1ccnc(n1)-c1cnc(C)c(c1)C(F)(F)F)n1cnc2n(C)c(=O)n(Cc3noc(C)n3)c(=O)c12 |r|
Show InChI InChI=1S/C24H21F3N10O4/c1-11-15(24(25,26)27)7-14(8-29-11)19-28-6-5-16(32-19)33-21(38)12(2)37-10-30-20-18(37)22(39)36(23(40)35(20)4)9-17-31-13(3)41-34-17/h5-8,10,12H,9H2,1-4H3,(H,28,32,33,38)/t12-/m0/s1
US Patent
n/an/a 2n/an/an/an/an/an/a
Hydra Biosciences, Inc.
US Patent
Assay Description
Compounds of Formula (I) inhibit the TRPA1 channel, as shown by measuring the in vitro inhibition of human TRPA1, provided in data tables shown in Ta...
US Patent US10221177 (2019)
BindingDB Entry DOI: 10.7270/Q2445PR8