BDBM361868 US10221177, Compound 241
SMILES: Cc1noc(Cn2c(=O)n(C)c3ncn(CC(=O)Nc4cccc(n4)-c4cnc(C)c(c4)C(F)(F)F)c3c2=O)n1
InChI Key: InChIKey=XPZXRJASCMUGQL-UHFFFAOYSA-N
Data: 1 IC50
Activity Spreadsheet -- Enzyme Inhibition Constant Data from BindingDB
Found 1 hit for monomerid = 361868
Trg + Lig
Ki
nM
ΔG°
kcal/mole
IC50
nM
Kd
nM
EC50/IC50
nM
koff
s-1
kon
M-1s-1
pHTemp
°C
Transient receptor potential cation channel subfamily A member 1
(Homo sapiens (Human))
BDBM361868
(US10221177, Compound 241)
Show SMILES Cc1noc(Cn2c(=O)n(C)c3ncn(CC(=O)Nc4cccc(n4)-c4cnc(C)c(c4)C(F)(F)F)c3c2=O)n1
Show InChI InChI=1S/C24H20F3N9O4/c1-12-15(24(25,26)27)7-14(8-28-12)16-5-4-6-17(31-16)32-18(37)9-35-11-29-21-20(35)22(38)36(23(39)34(21)3)10-19-30-13(2)33-40-19/h4-8,11H,9-10H2,1-3H3,(H,31,32,37)
US Patent
n/an/a 1n/an/an/an/an/an/a
Hydra Biosciences, Inc.
US Patent
Assay Description
Compounds of Formula (I) inhibit the TRPA1 channel, as shown by measuring the in vitro inhibition of human TRPA1, provided in data tables shown in Ta...
US Patent US10221177 (2019)
BindingDB Entry DOI: 10.7270/Q2445PR8