BDBM36209 3-homoadamantanecarboxylate (3HAC)
SMILES: OC(=O)C12CC3CC(CC(C3)CC1)C2
InChI Key: InChIKey=ZWJPDTCMULYABF-UHFFFAOYSA-N
Data: 2 ITC
Activity Spreadsheet -- ITC Data from BindingDB
Found 2 hits for monomerid = 36209
Cell (A)Syringe (B)Cell
Syringe
Cell + Syr
ΔG°
kcal/mole
-TΔS°
kcal/mole
ΔH°
kcal/mole
log KpHTemp
°C
BDBM11
JPEG
BDBM36209
JPEG
n/a1.88-7.504.157.2025
University of Mississippi
J Am Chem Soc 111: 6765-72 (1989)
BDBM4
JPEG
BDBM36209
JPEG
n/a1.13-4.612.547.2025
University of Mississippi
J Am Chem Soc 111: 6765-72 (1989)