BDBM36211 3-noradamantanecarboxylate (NAC)
SMILES: OC(=O)C12CC3CC1CC(C2)C3
InChI Key: InChIKey=RXUUYFUQAGICCD-UHFFFAOYSA-N
Data: 6 ITC
Activity Spreadsheet -- ITC Data from BindingDB
Found 6 hits for monomerid = 36211
Cell (A)Syringe (B)Cell
Syringe
Cell + Syr
ΔG°
kcal/mole
-TΔS°
kcal/mole
ΔH°
kcal/mole
log KpHTemp
°C
BDBM11
JPEG
BDBM36211
JPEG
n/a-1.28-3.753.708.525
University of Mississippi
J Am Chem Soc 111: 6765-72 (1989)
BDBM11
JPEG
BDBM36211
JPEG
n/a-1.46-3.613.737.2025
University of Mississippi
J Am Chem Soc 111: 6765-72 (1989)
BDBM11
JPEG
BDBM36211
JPEG
n/a-0.776-5.804.854.0525
University of Mississippi
J Am Chem Soc 111: 6765-72 (1989)
BDBM4
JPEG
BDBM36211
JPEG
n/a0.385-3.252.087.2025
University of Mississippi
J Am Chem Soc 111: 6765-72 (1989)
BDBM4
JPEG
BDBM36211
JPEG
n/an/a-3.102.294.0525
University of Mississippi
J Am Chem Soc 111: 6765-72 (1989)
BDBM4
JPEG
BDBM36211
JPEG
n/a-8.47-11.92.544.0525
University of Mississippi
J Am Chem Soc 111: 6765-72 (1989)