BDBM3624 5-[(3-Bromophenyl)amino]-1-methylpyrazolo[4,3-g]-quinazoline::N-(3-bromophenyl)-1-methyl-1H-pyrazolo[4,3-g]quinazolin-5-amine::Pyrazoloquinazoline deriv. 2b
SMILES: Cn1ncc2cc3c(Nc4cccc(Br)c4)ncnc3cc12
InChI Key: InChIKey=BBWYQCNFQUTQED-UHFFFAOYSA-N
Data: 2 IC50
Activity Spreadsheet -- Enzyme Inhibition Constant Data from BindingDB
Found 2 hits for monomerid = 3624
Trg + Lig
Ki
nM
ΔG°
kcal/mole
IC50
nM
Kd
nM
EC50/IC50
nM
koff
s-1
kon
M-1s-1
pHTemp
°C
Epidermal growth factor receptor
(Homo sapiens (Human))
BDBM3624
(5-[(3-Bromophenyl)amino]-1-methylpyrazolo[4,3-g]-q...)
Show SMILES Cn1ncc2cc3c(Nc4cccc(Br)c4)ncnc3cc12
Show InChI InChI=1S/C16H12BrN5/c1-22-15-7-14-13(5-10(15)8-20-22)16(19-9-18-14)21-12-4-2-3-11(17)6-12/h2-9H,1H3,(H,18,19,21)
n/an/a 12.9n/an/an/an/an/an/a
Korea Institute of Science and Technology
Curated by ChEMBL
Assay Description
Inhibition autophosphorylation of EGFR in human DiFi cells after 2 hrs by ELISA
Eur J Med Chem 43: 781-91 (2008)
Article DOI: 10.1016/j.ejmech.2007.06.006
BindingDB Entry DOI: 10.7270/Q2DJ5GXN
Epidermal growth factor receptor
(Homo sapiens (Human))
BDBM3624
(5-[(3-Bromophenyl)amino]-1-methylpyrazolo[4,3-g]-q...)
Show SMILES Cn1ncc2cc3c(Nc4cccc(Br)c4)ncnc3cc12
Show InChI InChI=1S/C16H12BrN5/c1-22-15-7-14-13(5-10(15)8-20-22)16(19-9-18-14)21-12-4-2-3-11(17)6-12/h2-9H,1H3,(H,18,19,21)
n/an/a 0.370n/an/an/an/a7.425
University of Auckland
Assay Description
IC50 is the inhibitor concentration which inhibits 50% of kinase activity that catalyzes the transfer of the terminal phosphate from [gamma-32P] labe...
J Med Chem 40: 1519-29 (1997)
Article DOI: 10.1021/jm960789h
BindingDB Entry DOI: 10.7270/Q2SJ1HRQ