BDBM36293 1,2,3-benzotriazole::Benzotriazole (Bta)
SMILES: c1ccc2nnnc2c1
InChI Key: InChIKey=QRUDEWIWKLJBPS-UHFFFAOYSA-N
Data: 1 IC50  1 Kd  1 ITC
Activity Spreadsheet -- Enzyme Inhibition Constant Data from BindingDB
Found 2 hits for monomerid = 36293
Trg + Lig
Ki
nM
ΔG°
kcal/mole
IC50
nM
Kd
nM
EC50/IC50
nM
koff
s-1
kon
M-1s-1
pHTemp
°C
Indoleamine 2,3-dioxygenase
(Homo sapiens (Human))
BDBM36293
(1,2,3-benzotriazole | Benzotriazole (Bta))
Show SMILES c1ccc2nnnc2c1
Show InChI InChI=1S/C6H5N3/c1-2-4-6-5(3-1)7-9-8-6/h1-4H,(H,7,8,9)
Reactome pathway
n/an/a 2.57E+6n/an/an/an/an/an/a
Fudan University
Curated by ChEMBL
Assay Description
Inhibition of human recombinant indoleamine-2,3-dioxygenase expressed in Escherichia coli BL21 using L-tryptophan as substrate after 30 mins by micro...
Eur J Med Chem 46: 5680-7 (2011)
Article DOI: 10.1016/j.ejmech.2011.08.044
BindingDB Entry DOI: 10.7270/Q2KH0NRS
Dehaloperoxidase B (DHP B)
(Amphitrite ornata)
BDBM36293
(1,2,3-benzotriazole | Benzotriazole (Bta))
Show SMILES c1ccc2nnnc2c1
Show InChI InChI=1S/C6H5N3/c1-2-4-6-5(3-1)7-9-8-6/h1-4H,(H,7,8,9)
n/an/an/a 8.20E+4n/an/an/a7.0n/a
North Carolina State University
Assay Description
Samples for solution resonance Raman spectroscopic studies were prepared withfinal concentrations of 75 μM WT DHP B and 3.75 mM azole in 100 mM ...
Biochemistry 56: 2294-2303 (2017)
Article DOI: 10.1021/acs.biochem.7b00041
BindingDB Entry DOI: 10.7270/Q2XS5T7W
Activity Spreadsheet -- ITC Data from BindingDB
Found 1 hit for monomerid = 36293
Cell (A)Syringe (B)Cell
Syringe
Cell + Syr
ΔG°
kcal/mole
-TΔS°
kcal/mole
ΔH°
kcal/mole
log KpHTemp
°C
BDBM36284
JPEG
BDBM36293
JPEG
-5.19n/an/a3.81725
University of Cambridge
J Phys Chem B 114: 8606-15 (2010)