BDBM3630 5-[(3-Bromophenyl)amino]-1-methylpyrrolo[3,2-g]-quinazoline::N-(3-bromophenyl)-8-methyl-8H-pyrrolo[3,2-g]quinazolin-4-amine::Pyrroloquinazoline deriv. 3b
SMILES: Cn1ccc2cc3c(Nc4cccc(Br)c4)ncnc3cc12
InChI Key: InChIKey=QHAWLYRLLOXJAY-UHFFFAOYSA-N
Data: 2 IC50
Activity Spreadsheet -- Enzyme Inhibition Constant Data from BindingDB
Found 2 hits for monomerid = 3630
Trg + Lig
Ki
nM
ΔG°
kcal/mole
IC50
nM
Kd
nM
EC50/IC50
nM
koff
s-1
kon
M-1s-1
pHTemp
°C
Epidermal growth factor receptor
(Homo sapiens (Human))
BDBM3630
(5-[(3-Bromophenyl)amino]-1-methylpyrrolo[3,2-g]-qu...)
Show SMILES Cn1ccc2cc3c(Nc4cccc(Br)c4)ncnc3cc12
Show InChI InChI=1S/C17H13BrN4/c1-22-6-5-11-7-14-15(9-16(11)22)19-10-20-17(14)21-13-4-2-3-12(18)8-13/h2-10H,1H3,(H,19,20,21)
n/an/a 21.9n/an/an/an/an/an/a
Korea Institute of Science and Technology
Curated by ChEMBL
Assay Description
Inhibition autophosphorylation of EGFR in human DiFi cells after 2 hrs by ELISA
Eur J Med Chem 43: 781-91 (2008)
Article DOI: 10.1016/j.ejmech.2007.06.006
BindingDB Entry DOI: 10.7270/Q2DJ5GXN
Epidermal growth factor receptor
(Homo sapiens (Human))
BDBM3630
(5-[(3-Bromophenyl)amino]-1-methylpyrrolo[3,2-g]-qu...)
Show SMILES Cn1ccc2cc3c(Nc4cccc(Br)c4)ncnc3cc12
Show InChI InChI=1S/C17H13BrN4/c1-22-6-5-11-7-14-15(9-16(11)22)19-10-20-17(14)21-13-4-2-3-12(18)8-13/h2-10H,1H3,(H,19,20,21)
n/an/a 0.800n/an/an/an/a7.425
University of Auckland
Assay Description
IC50 is the inhibitor concentration which inhibits 50% of kinase activity that catalyzes the transfer of the terminal phosphate from [gamma-32P] labe...
J Med Chem 40: 1519-29 (1997)
Article DOI: 10.1021/jm960789h
BindingDB Entry DOI: 10.7270/Q2SJ1HRQ