BDBM36321 5-cyclohexene-indolyl- 2'-deoxyriboside triphosphate::d5-CEITP
SMILES: [H][C@]1(O)C[C@@]([H])(O[C@]1([H])COP(O)(=O)OP(O)(=O)OP(O)(O)=O)n1ccc2cc(ccc12)C1=CCCCC1
InChI Key: InChIKey=MULAYULWWGOMCH-IPMKNSEASA-N
Data: 2 KI
Activity Spreadsheet -- Enzyme Inhibition Constant Data from BindingDB
Found 2 hits for monomerid = 36321
Trg + Lig
Ki
nM
ΔG°
kcal/mole
IC50
nM
Kd
nM
EC50/IC50
nM
koff
s-1
kon
M-1s-1
pHTemp
°C
ATP-dependent clamp loaders gp44/62
(Enterobacteria phage T4 (Bacteriophage T4))
BDBM36321
(5-cyclohexene-indolyl- 2'-deoxyriboside tripho...)
Show SMILES [H][C@]1(O)C[C@@]([H])(O[C@]1([H])COP(O)(=O)OP(O)(=O)OP(O)(O)=O)n1ccc2cc(ccc12)C1=CCCCC1 |t:35|
Show InChI InChI=1S/C19H26NO12P3/c21-17-11-19(30-18(17)12-29-34(25,26)32-35(27,28)31-33(22,23)24)20-9-8-15-10-14(6-7-16(15)20)13-4-2-1-3-5-13/h4,6-10,17-19,21H,1-3,5,11-12H2,(H,25,26)(H,27,28)(H2,22,23,24)/t17-,18+,19+/m0/s1
1.00E+4 -6.82n/an/an/an/an/a7.525
Case Western Reserve University
Assay Description
ATPase assay contained 10 mM Mg2+, 1uM 13/20 DNA, 500uM (r)NTP or (d)NTP, 500 nM gp45, and 500 nM gp44/62 in T4 buffer. ATPase activity was measured ...
ACS Chem Biol 5: 183-94 (2010)
Article DOI: 10.1021/cb900218c
BindingDB Entry DOI: 10.7270/Q26M356K
DNA polymerase III subunit gamma
(Escherichia coli)
BDBM36321
(5-cyclohexene-indolyl- 2'-deoxyriboside tripho...)
Show SMILES [H][C@]1(O)C[C@@]([H])(O[C@]1([H])COP(O)(=O)OP(O)(=O)OP(O)(O)=O)n1ccc2cc(ccc12)C1=CCCCC1 |t:35|
Show InChI InChI=1S/C19H26NO12P3/c21-17-11-19(30-18(17)12-29-34(25,26)32-35(27,28)31-33(22,23)24)20-9-8-15-10-14(6-7-16(15)20)13-4-2-1-3-5-13/h4,6-10,17-19,21H,1-3,5,11-12H2,(H,25,26)(H,27,28)(H2,22,23,24)/t17-,18+,19+/m0/s1
1.18E+4 -6.99n/an/an/an/an/a7.537
Case Western Reserve University
Assay Description
ATPase assay contained 10 mM Mg2+, 1uM 13/20 DNA, 500uM (r)NTP or (d)NTP, 500 nM gp45, and 500 nM gp44/62 in T4 buffer. ATPase activity was measured ...
ACS Chem Biol 5: 183-94 (2010)
Article DOI: 10.1021/cb900218c
BindingDB Entry DOI: 10.7270/Q26M356K