BDBM36333 LI-0::Legumain Inhibitor -0
SMILES: CC(=O)N1CCC[C@H]1C(=O)N[C@H](CCOC(=O)c1c(C)cccc1C)CC(O)=O
InChI Key: InChIKey=LEZYKWQCDKWUNG-SJORKVTESA-N
Data: 4 IC50
Activity Spreadsheet -- Enzyme Inhibition Constant Data from BindingDB
Found 4 hits for monomerid = 36333
Trg + Lig
Ki
nM
ΔG°
kcal/mole
IC50
nM
Kd
nM
EC50/IC50
nM
koff
s-1
kon
M-1s-1
pHTemp
°C
Legumain
(Mus musculus)
BDBM36333
(LI-0 | Legumain Inhibitor -0)
Show SMILES CC(=O)N1CCC[C@H]1C(=O)N[C@H](CCOC(=O)c1c(C)cccc1C)CC(O)=O |r|
Show InChI InChI=1S/C21H28N2O6/c1-13-6-4-7-14(2)19(13)21(28)29-11-9-16(12-18(25)26)22-20(27)17-8-5-10-23(17)15(3)24/h4,6-7,16-17H,5,8-12H2,1-3H3,(H,22,27)(H,25,26)/t16-,17+/m1/s1
Reactome pathway
n/an/a 704n/an/an/an/a5.825
Stanford University
Assay Description
IC50 measurements and enzyme kinetics assays were performed on a Spectramax M5 fluorescent plate reader (Molecular Devices).
ACS Chem Biol 5: 233-43 (2010)
Article DOI: 10.1021/cb900232a
BindingDB Entry DOI: 10.7270/Q2Z31X0W
Caspase-3
(Mus musculus)
BDBM36333
(LI-0 | Legumain Inhibitor -0)
Show SMILES CC(=O)N1CCC[C@H]1C(=O)N[C@H](CCOC(=O)c1c(C)cccc1C)CC(O)=O |r|
Show InChI InChI=1S/C21H28N2O6/c1-13-6-4-7-14(2)19(13)21(28)29-11-9-16(12-18(25)26)22-20(27)17-8-5-10-23(17)15(3)24/h4,6-7,16-17H,5,8-12H2,1-3H3,(H,22,27)(H,25,26)/t16-,17+/m1/s1
Reactome pathway
n/an/a 2.80E+3n/an/an/an/a7.425
Stanford University
Assay Description
IC50 measurements and enzyme kinetics assays were performed on a Spectramax M5 fluorescent plate reader (Molecular Devices).
ACS Chem Biol 5: 233-43 (2010)
Article DOI: 10.1021/cb900232a
BindingDB Entry DOI: 10.7270/Q2Z31X0W
Cathepsin L
(Mus musculus)
BDBM36333
(LI-0 | Legumain Inhibitor -0)
Show SMILES CC(=O)N1CCC[C@H]1C(=O)N[C@H](CCOC(=O)c1c(C)cccc1C)CC(O)=O |r|
Show InChI InChI=1S/C21H28N2O6/c1-13-6-4-7-14(2)19(13)21(28)29-11-9-16(12-18(25)26)22-20(27)17-8-5-10-23(17)15(3)24/h4,6-7,16-17H,5,8-12H2,1-3H3,(H,22,27)(H,25,26)/t16-,17+/m1/s1
Reactome pathway
n/an/a>1.00E+6n/an/an/an/a6.2525
Stanford University
Assay Description
IC50 measurements and enzyme kinetics assays were performed on a Spectramax M5 fluorescent plate reader (Molecular Devices).
ACS Chem Biol 5: 233-43 (2010)
Article DOI: 10.1021/cb900232a
BindingDB Entry DOI: 10.7270/Q2Z31X0W
Cathepsin B
(Mus musculus)
BDBM36333
(LI-0 | Legumain Inhibitor -0)
Show SMILES CC(=O)N1CCC[C@H]1C(=O)N[C@H](CCOC(=O)c1c(C)cccc1C)CC(O)=O |r|
Show InChI InChI=1S/C21H28N2O6/c1-13-6-4-7-14(2)19(13)21(28)29-11-9-16(12-18(25)26)22-20(27)17-8-5-10-23(17)15(3)24/h4,6-7,16-17H,5,8-12H2,1-3H3,(H,22,27)(H,25,26)/t16-,17+/m1/s1
Reactome pathway
n/an/a>1.00E+6n/an/an/an/a6.2525
Stanford University
Assay Description
IC50 measurements and enzyme kinetics assays were performed on a Spectramax M5 fluorescent plate reader (Molecular Devices).
ACS Chem Biol 5: 233-43 (2010)
Article DOI: 10.1021/cb900232a
BindingDB Entry DOI: 10.7270/Q2Z31X0W