BDBM36339 3-{2-trans-(4-Amino-cyclohexylamino)-6-[4-(piperidine-1-carbonyl)-phenylamino]-purin-9-yl}-benzoic acid, 7::CID24762169
SMILES: N[C@H]1CC[C@@H](CC1)Nc1nc(Nc2ccc(cc2)C(=O)N2CCCCC2)c2ncn(-c3cccc(c3)C(O)=O)c2n1
InChI Key: InChIKey=BHXXSHMBKTZRLV-AFARHQOCSA-N
Data: 1 IC50  1 EC50
Activity Spreadsheet -- Enzyme Inhibition Constant Data from BindingDB
Found 2 hits for monomerid = 36339
Trg + Lig
Ki
nM
ΔG°
kcal/mole
IC50
nM
Kd
nM
EC50/IC50
nM
koff
s-1
kon
M-1s-1
pHTemp
°C
Calcium-dependent protein kinase 1
(Plasmodium Falciparum)
BDBM36339
(3-{2-trans-(4-Amino-cyclohexylamino)-6-[4-(piperid...)
Show SMILES N[C@H]1CC[C@@H](CC1)Nc1nc(Nc2ccc(cc2)C(=O)N2CCCCC2)c2ncn(-c3cccc(c3)C(O)=O)c2n1 |r,wU:4.7,wD:1.0,(-8.67,.31,;-7.34,-.46,;-7.34,-2,;-6,-2.77,;-4.67,-2,;-4.67,-.46,;-6,.31,;-3.33,-2.77,;-2,-2,;-2,-.46,;-.67,.31,;-.67,1.85,;.67,2.62,;2,1.85,;3.33,2.62,;3.33,4.16,;2,4.93,;.67,4.16,;4.67,4.93,;4.67,6.47,;6,4.16,;6,2.62,;7.34,1.85,;8.67,2.62,;8.67,4.16,;7.34,4.93,;.67,-.46,;2.13,.02,;3.04,-1.23,;2.13,-2.47,;2.9,-3.81,;2.13,-5.14,;2.9,-6.47,;4.44,-6.47,;5.21,-5.14,;4.44,-3.81,;6.75,-5.14,;7.84,-6.23,;7.52,-3.81,;.67,-2,;-.67,-2.77,)|
Show InChI InChI=1S/C30H34N8O3/c31-21-9-13-23(14-10-21)34-30-35-26(33-22-11-7-19(8-12-22)28(39)37-15-2-1-3-16-37)25-27(36-30)38(18-32-25)24-6-4-5-20(17-24)29(40)41/h4-8,11-12,17-18,21,23H,1-3,9-10,13-16,31H2,(H,40,41)(H2,33,34,35,36)/t21-,23-
n/an/an/an/a>1.00E+4n/an/a7.524
The Scripps Research Institute
Nat Chem Biol 4: 347-56 (2008)
Article DOI: 10.1038/nchembio.87
BindingDB Entry DOI: 10.7270/Q2TB1573
Calcium-dependent protein kinase 1
(Plasmodium Falciparum)
BDBM36339
(3-{2-trans-(4-Amino-cyclohexylamino)-6-[4-(piperid...)
Show SMILES N[C@H]1CC[C@@H](CC1)Nc1nc(Nc2ccc(cc2)C(=O)N2CCCCC2)c2ncn(-c3cccc(c3)C(O)=O)c2n1 |r,wU:4.7,wD:1.0,(-8.67,.31,;-7.34,-.46,;-7.34,-2,;-6,-2.77,;-4.67,-2,;-4.67,-.46,;-6,.31,;-3.33,-2.77,;-2,-2,;-2,-.46,;-.67,.31,;-.67,1.85,;.67,2.62,;2,1.85,;3.33,2.62,;3.33,4.16,;2,4.93,;.67,4.16,;4.67,4.93,;4.67,6.47,;6,4.16,;6,2.62,;7.34,1.85,;8.67,2.62,;8.67,4.16,;7.34,4.93,;.67,-.46,;2.13,.02,;3.04,-1.23,;2.13,-2.47,;2.9,-3.81,;2.13,-5.14,;2.9,-6.47,;4.44,-6.47,;5.21,-5.14,;4.44,-3.81,;6.75,-5.14,;7.84,-6.23,;7.52,-3.81,;.67,-2,;-.67,-2.77,)|
Show InChI InChI=1S/C30H34N8O3/c31-21-9-13-23(14-10-21)34-30-35-26(33-22-11-7-19(8-12-22)28(39)37-15-2-1-3-16-37)25-27(36-30)38(18-32-25)24-6-4-5-20(17-24)29(40)41/h4-8,11-12,17-18,21,23H,1-3,9-10,13-16,31H2,(H,40,41)(H2,33,34,35,36)/t21-,23-
n/an/a 71n/an/an/an/a7.524
The Scripps Research Institute
Assay Description
The test compounds and enzyme were mixed in buffer, and the substrate and [gamma-33P] ATP/ATP were added to the mixture to initiate the reaction. Aft...
Nat Chem Biol 4: 347-56 (2008)
Article DOI: 10.1038/nchembio.87
BindingDB Entry DOI: 10.7270/Q2TB1573