BDBM36346 CID24762176::{4-[9-Phenyl-2-(quinolin-3-ylamino)-9H-purin-6-ylamino]-phenyl}-piperidin-1-yl-methanone, 14
SMILES: O=C(N1CCCCC1)c1ccc(Nc2nc(Nc3cnc4ccccc4c3)nc3n(cnc23)-c2ccccc2)cc1
InChI Key: InChIKey=JFKORUODURSSTQ-UHFFFAOYSA-N
Data: 1 IC50  1 EC50
Activity Spreadsheet -- Enzyme Inhibition Constant Data from BindingDB
Found 2 hits for monomerid = 36346
Trg + Lig
Ki
nM
ΔG°
kcal/mole
IC50
nM
Kd
nM
EC50/IC50
nM
koff
s-1
kon
M-1s-1
pHTemp
°C
Calcium-dependent protein kinase 1
(Plasmodium Falciparum)
BDBM36346
(CID24762176 | {4-[9-Phenyl-2-(quinolin-3-ylamino)-...)
Show SMILES O=C(N1CCCCC1)c1ccc(Nc2nc(Nc3cnc4ccccc4c3)nc3n(cnc23)-c2ccccc2)cc1
Show InChI InChI=1S/C32H28N8O/c41-31(39-17-7-2-8-18-39)22-13-15-24(16-14-22)35-29-28-30(40(21-34-28)26-10-3-1-4-11-26)38-32(37-29)36-25-19-23-9-5-6-12-27(23)33-20-25/h1,3-6,9-16,19-21H,2,7-8,17-18H2,(H2,35,36,37,38)
n/an/an/an/a 101n/an/a7.524
The Scripps Research Institute
Nat Chem Biol 4: 347-56 (2008)
Article DOI: 10.1038/nchembio.87
BindingDB Entry DOI: 10.7270/Q2TB1573
Calcium-dependent protein kinase 1
(Plasmodium Falciparum)
BDBM36346
(CID24762176 | {4-[9-Phenyl-2-(quinolin-3-ylamino)-...)
Show SMILES O=C(N1CCCCC1)c1ccc(Nc2nc(Nc3cnc4ccccc4c3)nc3n(cnc23)-c2ccccc2)cc1
Show InChI InChI=1S/C32H28N8O/c41-31(39-17-7-2-8-18-39)22-13-15-24(16-14-22)35-29-28-30(40(21-34-28)26-10-3-1-4-11-26)38-32(37-29)36-25-19-23-9-5-6-12-27(23)33-20-25/h1,3-6,9-16,19-21H,2,7-8,17-18H2,(H2,35,36,37,38)
n/an/a 3.85E+3n/an/an/an/a7.524
The Scripps Research Institute
Assay Description
The test compounds and enzyme were mixed in buffer, and the substrate and [gamma-33P] ATP/ATP were added to the mixture to initiate the reaction. Aft...
Nat Chem Biol 4: 347-56 (2008)
Article DOI: 10.1038/nchembio.87
BindingDB Entry DOI: 10.7270/Q2TB1573