BDBM36401 (2S)-2-Methyl-2,3-dihydrothieno[2,3-f][1,4]oxazepin-5-amine, 14::CID24894153
SMILES: C[C@H]1CN=C(N)c2sccc2O1
InChI Key: InChIKey=TUOXPJFCQDMQOX-YFKPBYRVSA-N
Data: 3 IC50
PDB links: 1 PDB ID matches this monomer.
Activity Spreadsheet -- Enzyme Inhibition Constant Data from BindingDB
Found 3 hits for monomerid = 36401
Trg + Lig
Ki
nM
ΔG°
kcal/mole
IC50
nM
Kd
nM
EC50/IC50
nM
koff
s-1
kon
M-1s-1
pHTemp
°C
Nitric oxide synthase, inducible
(Homo sapiens (Human))
BDBM36401
((2S)-2-Methyl-2,3-dihydrothieno[2,3-f][1,4]oxazepi...)
Show SMILES C[C@H]1CN=C(N)c2sccc2O1 |t:3|
Show InChI InChI=1S/C8H10N2OS/c1-5-4-10-8(9)7-6(11-5)2-3-12-7/h2-3,5H,4H2,1H3,(H2,9,10)/t5-/m0/s1
NCI pathway
Reactome pathway
n/an/a 40n/an/an/an/a7.037
The Scripps Research Institute
Assay Description
Nitric oxide formation from NOS was monitored by the hemoglobin capture assay. The assay was initiated by addition of enzyme and was monitored at 401...
Nat Chem Biol 4: 700-7 (2008)
Article DOI: 10.1038/nchembio.115
BindingDB Entry DOI: 10.7270/Q2SB443Q
3D
3D Structure (crystal)
Nitric oxide synthase, brain
(Homo sapiens (Human))
BDBM36401
((2S)-2-Methyl-2,3-dihydrothieno[2,3-f][1,4]oxazepi...)
Show SMILES C[C@H]1CN=C(N)c2sccc2O1 |t:3|
Show InChI InChI=1S/C8H10N2OS/c1-5-4-10-8(9)7-6(11-5)2-3-12-7/h2-3,5H,4H2,1H3,(H2,9,10)/t5-/m0/s1
Reactome pathway
n/an/a 80n/an/an/an/a7.037
The Scripps Research Institute
Assay Description
Nitric oxide formation from NOS was monitored by the hemoglobin capture assay. The assay was initiated by addition of enzyme and was monitored at 401...
Nat Chem Biol 4: 700-7 (2008)
Article DOI: 10.1038/nchembio.115
BindingDB Entry DOI: 10.7270/Q2SB443Q
Nitric oxide synthase, endothelial
(Homo sapiens (Human))
BDBM36401
((2S)-2-Methyl-2,3-dihydrothieno[2,3-f][1,4]oxazepi...)
Show SMILES C[C@H]1CN=C(N)c2sccc2O1 |t:3|
Show InChI InChI=1S/C8H10N2OS/c1-5-4-10-8(9)7-6(11-5)2-3-12-7/h2-3,5H,4H2,1H3,(H2,9,10)/t5-/m0/s1
n/an/a 80n/an/an/an/a7.037
The Scripps Research Institute
Assay Description
Nitric oxide formation from NOS was monitored by the hemoglobin capture assay. The assay was initiated by addition of enzyme and was monitored at 401...
Nat Chem Biol 4: 700-7 (2008)
Article DOI: 10.1038/nchembio.115
BindingDB Entry DOI: 10.7270/Q2SB443Q