BDBM3646 2-({4-[(3-bromophenyl)amino]pyrido[4,3-d]pyrimidin-7-yl}amino)ethan-1-ol::4-[(3-Bromophenyl)amino]-7-[(2-hydroxyethyl)amino]-pyrido[4,3-d]pyrimidine::pyrido[4,3-d]pyrimidine deriv. 3d
SMILES: OCCNc1cc2ncnc(Nc3cccc(Br)c3)c2cn1
InChI Key: InChIKey=BGHDMTQKOHCXGS-UHFFFAOYSA-N
Data: 1 IC50
Activity Spreadsheet -- Enzyme Inhibition Constant Data from BindingDB
Found 1 hit for monomerid = 3646
Trg + Lig
Ki
nM
ΔG°
kcal/mole
IC50
nM
Kd
nM
EC50/IC50
nM
koff
s-1
kon
M-1s-1
pHTemp
°C
Epidermal growth factor receptor
(Homo sapiens (Human))
BDBM3646
(2-({4-[(3-bromophenyl)amino]pyrido[4,3-d]pyrimidin...)
Show SMILES OCCNc1cc2ncnc(Nc3cccc(Br)c3)c2cn1
Show InChI InChI=1S/C15H14BrN5O/c16-10-2-1-3-11(6-10)21-15-12-8-18-14(17-4-5-22)7-13(12)19-9-20-15/h1-3,6-9,22H,4-5H2,(H,17,18)(H,19,20,21)
n/an/a 0.240n/an/an/an/a7.425
University of Auckland
Assay Description
IC50 is the inhibitor concentration which inhibits 50% of kinase activity that catalyzes the transfer of the terminal phosphate from [gamma-32P] labe...
J Med Chem 40: 3915-25 (1997)
Article DOI: 10.1021/jm970366v
BindingDB Entry DOI: 10.7270/Q2NS0S2V