BDBM36465 2-(4-(Butyl(methyl)amino)-6-(2-methoxyphenethylamino)-1,3,5-triazin-2-ylamino)-3-(1H-pyrrolo[2,3-b]pyridin-3-yl)propanamide::DEL-A, 6
SMILES: CCCCN(C)c1nc(NCCc2ccccc2OC)nc(NC(Cc2c[nH]c3ncccc23)C(N)=O)n1
InChI Key: InChIKey=AXSIEBLMJCMGJS-UHFFFAOYSA-N
Data: 1 IC50
Activity Spreadsheet -- Enzyme Inhibition Constant Data from BindingDB
Found 1 hit for monomerid = 36465
Trg + Lig
Ki
nM
ΔG°
kcal/mole
IC50
nM
Kd
nM
EC50/IC50
nM
koff
s-1
kon
M-1s-1
pHTemp
°C
Aurora kinase A
(Homo sapiens (Human))
BDBM36465
(2-(4-(Butyl(methyl)amino)-6-(2-methoxyphenethylami...)
Show SMILES CCCCN(C)c1nc(NCCc2ccccc2OC)nc(NC(Cc2c[nH]c3ncccc23)C(N)=O)n1
Show InChI InChI=1S/C27H35N9O2/c1-4-5-15-36(2)27-34-25(30-14-12-18-9-6-7-11-22(18)38-3)33-26(35-27)32-21(23(28)37)16-19-17-31-24-20(19)10-8-13-29-24/h6-11,13,17,21H,4-5,12,14-16H2,1-3H3,(H2,28,37)(H,29,31)(H2,30,32,33,34,35)
NCI pathway
Reactome pathway
n/an/a 3.80E+3n/an/an/an/a9.516
Praecis Pharmaceuticals
Assay Description
Selection of DNA-encoded libraries (DELs) which are covalent attachment of encoding double stranded DNA to small-molecule created using a combination...
Nat Chem Biol 5: 647-54 (2009)
Article DOI: 10.1038/nchembio.211
BindingDB Entry DOI: 10.7270/Q2MP51NX