BDBM36468 2-(4-(2-Methoxyphenethylamino)-6-(quinolin-6-ylamino)-1,3,5-triazin-2-ylamino)-3-(1H-pyrrolo[2,3-b]pyridin-3-yl)propanamide::DEL-A, 9
SMILES: COc1ccccc1CCNc1nc(NC(Cc2c[nH]c3ncccc23)C(N)=O)nc(Nc2ccc3ncccc3c2)n1
InChI Key: InChIKey=OMWYORTUSDNQOK-UHFFFAOYSA-N
Data: 1 IC50
Activity Spreadsheet -- Enzyme Inhibition Constant Data from BindingDB
Found 1 hit for monomerid = 36468
Trg + Lig
Ki
nM
ΔG°
kcal/mole
IC50
nM
Kd
nM
EC50/IC50
nM
koff
s-1
kon
M-1s-1
pHTemp
°C
Aurora kinase A
(Homo sapiens (Human))
BDBM36468
(2-(4-(2-Methoxyphenethylamino)-6-(quinolin-6-ylami...)
Show SMILES COc1ccccc1CCNc1nc(NC(Cc2c[nH]c3ncccc23)C(N)=O)nc(Nc2ccc3ncccc3c2)n1
Show InChI InChI=1S/C31H30N10O2/c1-43-26-9-3-2-6-19(26)12-15-35-29-39-30(37-22-10-11-24-20(16-22)7-4-13-33-24)41-31(40-29)38-25(27(32)42)17-21-18-36-28-23(21)8-5-14-34-28/h2-11,13-14,16,18,25H,12,15,17H2,1H3,(H2,32,42)(H,34,36)(H3,35,37,38,39,40,41)
NCI pathway
Reactome pathway
n/an/a 3.70E+3n/an/an/an/a9.516
Praecis Pharmaceuticals
Assay Description
Selection of DNA-encoded libraries (DELs) which are covalent attachment of encoding double stranded DNA to small-molecule created using a combination...
Nat Chem Biol 5: 647-54 (2009)
Article DOI: 10.1038/nchembio.211
BindingDB Entry DOI: 10.7270/Q2MP51NX