BDBM3652 4-[(3-Bromophenyl)amino]-7-D-glucaminopyrido[4,3-d]-pyrimidine::6-({4-[(3-bromophenyl)amino]pyrido[4,3-d]pyrimidin-7-yl}amino)hexane-1,2,3,4,5-pentol::pyrido[4,3-d]pyrimidine deriv. 3j
SMILES: OCC(O)C(O)C(O)C(O)CNc1cc2ncnc(Nc3cccc(Br)c3)c2cn1
InChI Key: InChIKey=CHHPKSCSIBSQIU-UHFFFAOYSA-N
Data: 1 IC50
Activity Spreadsheet -- Enzyme Inhibition Constant Data from BindingDB
Found 1 hit for monomerid = 3652
Trg + Lig
Ki
nM
ΔG°
kcal/mole
IC50
nM
Kd
nM
EC50/IC50
nM
koff
s-1
kon
M-1s-1
pHTemp
°C
Epidermal growth factor receptor
(Homo sapiens (Human))
BDBM3652
(4-[(3-Bromophenyl)amino]-7-D-glucaminopyrido[4,3-d...)
Show SMILES OCC(O)C(O)C(O)C(O)CNc1cc2ncnc(Nc3cccc(Br)c3)c2cn1
Show InChI InChI=1S/C19H22BrN5O5/c20-10-2-1-3-11(4-10)25-19-12-6-21-16(5-13(12)23-9-24-19)22-7-14(27)17(29)18(30)15(28)8-26/h1-6,9,14-15,17-18,26-30H,7-8H2,(H,21,22)(H,23,24,25)
n/an/a 4.80n/an/an/an/a7.425
University of Auckland
Assay Description
IC50 is the inhibitor concentration which inhibits 50% of kinase activity that catalyzes the transfer of the terminal phosphate from [gamma-32P] labe...
J Med Chem 40: 3915-25 (1997)
Article DOI: 10.1021/jm970366v
BindingDB Entry DOI: 10.7270/Q2NS0S2V