BDBM365305 US9868720, No. 426::{3-[2-(3,3-Difluoro- pyrrolidin-1-yl)-6-(4-methyl- pyridin-2-ylamino)-pyrimidin- 4-yl]-piperidin- 1-yl}-(2-methoxy-4- methyl-phenyl)-methanone
SMILES: COc1cc(C)ccc1C(=O)N1CCCC(C1)c1cc(Nc2cc(C)ccn2)nc(n1)N1CCC(F)(F)C1
InChI Key: InChIKey=JJUHXDQPKXGOMS-UHFFFAOYSA-N
Data: 1 KI
Activity Spreadsheet -- Enzyme Inhibition Constant Data from BindingDB
Found 1 hit for monomerid = 365305
Trg + Lig
Ki
nM
ΔG°
kcal/mole
IC50
nM
Kd
nM
EC50/IC50
nM
koff
s-1
kon
M-1s-1
pHTemp
°C
Mitogen-activated protein kinase kinase kinase 12
(Homo sapiens (Human))
BDBM365305
(US9868720, No. 426 | {3-[2-(3,3-Difluoro- pyrroli...)
Show SMILES COc1cc(C)ccc1C(=O)N1CCCC(C1)c1cc(Nc2cc(C)ccn2)nc(n1)N1CCC(F)(F)C1
Show InChI InChI=1S/C28H32F2N6O2/c1-18-6-7-21(23(13-18)38-3)26(37)35-11-4-5-20(16-35)22-15-25(33-24-14-19(2)8-10-31-24)34-27(32-22)36-12-9-28(29,30)17-36/h6-8,10,13-15,20H,4-5,9,11-12,16-17H2,1-3H3,(H,31,32,33,34)
US Patent
0.5n/an/an/an/an/an/an/an/a
Amgen
Assay Description
DLK kinase reactions (20 μL) containing 5 nM N-terminally GST-tagged DLK (catalytic domain amino acid 1-520) (Carna Bioscience), 40 nM N-termina...
J Med Chem 50: 3515-27 (2007)
BindingDB Entry DOI: 10.7270/Q2J38VWN