BDBM3654 4-N-(3-bromophenyl)-7-N-[2-(dimethylamino)ethyl]pyrido[4,3-d]pyrimidine-4,7-diamine::4-[(3-Bromophenyl)amino]-7-[[2-(dimethylamino)ethyl]amino]pyrido[4,3-d]pyrimidine::pyrido[4,3-d]pyrimidine deriv. 3l
SMILES: CN(C)CCNc1cc2ncnc(Nc3cccc(Br)c3)c2cn1
InChI Key: InChIKey=YOKVZXZOOHPMFL-UHFFFAOYSA-N
Data: 1 IC50
Activity Spreadsheet -- Enzyme Inhibition Constant Data from BindingDB
Found 1 hit for monomerid = 3654
Trg + Lig
Ki
nM
ΔG°
kcal/mole
IC50
nM
Kd
nM
EC50/IC50
nM
koff
s-1
kon
M-1s-1
pHTemp
°C
Epidermal growth factor receptor
(Homo sapiens (Human))
BDBM3654
(4-N-(3-bromophenyl)-7-N-[2-(dimethylamino)ethyl]py...)
Show SMILES CN(C)CCNc1cc2ncnc(Nc3cccc(Br)c3)c2cn1
Show InChI InChI=1S/C17H19BrN6/c1-24(2)7-6-19-16-9-15-14(10-20-16)17(22-11-21-15)23-13-5-3-4-12(18)8-13/h3-5,8-11H,6-7H2,1-2H3,(H,19,20)(H,21,22,23)
n/an/a 45n/an/an/an/a7.425
University of Auckland
Assay Description
IC50 is the inhibitor concentration which inhibits 50% of kinase activity that catalyzes the transfer of the terminal phosphate from [gamma-32P] labe...
J Med Chem 40: 3915-25 (1997)
Article DOI: 10.1021/jm970366v
BindingDB Entry DOI: 10.7270/Q2NS0S2V