BDBM3661 4-N-(3-bromophenyl)-7-N-[4-(morpholin-4-yl)butyl]pyrido[4,3-d]pyrimidine-4,7-diamine::4-[(3-Bromophenyl)amino]-7-[[4-(4-morpholino)butyl]-amino]pyrido[4,3-d]pyrimidine::pyrido[4,3-d]pyrimidine deriv. 3s
SMILES: Brc1cccc(Nc2ncnc3cc(NCCCCN4CCOCC4)ncc23)c1
InChI Key: InChIKey=LGQGASCJEHGWJL-UHFFFAOYSA-N
Data: 1 IC50
Activity Spreadsheet -- Enzyme Inhibition Constant Data from BindingDB
Found 1 hit for monomerid = 3661
Trg + Lig
Ki
nM
ΔG°
kcal/mole
IC50
nM
Kd
nM
EC50/IC50
nM
koff
s-1
kon
M-1s-1
pHTemp
°C
Epidermal growth factor receptor
(Homo sapiens (Human))
BDBM3661
(4-N-(3-bromophenyl)-7-N-[4-(morpholin-4-yl)butyl]p...)
Show SMILES Brc1cccc(Nc2ncnc3cc(NCCCCN4CCOCC4)ncc23)c1
Show InChI InChI=1S/C21H25BrN6O/c22-16-4-3-5-17(12-16)27-21-18-14-24-20(13-19(18)25-15-26-21)23-6-1-2-7-28-8-10-29-11-9-28/h3-5,12-15H,1-2,6-11H2,(H,23,24)(H,25,26,27)
n/an/a 5.40n/an/an/an/an/an/a
University of Auckland
Assay Description
IC50 is the inhibitor concentration which inhibits 50% of kinase activity that catalyzes the transfer of the terminal phosphate from [gamma-32P] labe...
J Med Chem 40: 3915-25 (1997)
Article DOI: 10.1021/jm970366v
BindingDB Entry DOI: 10.7270/Q2NS0S2V