null
SMILES: Fc1ccc(Cn2cccc(C(=O)NCc3ccc(s3)-c3c[nH]c4ncc(Cl)cc34)c2=O)cc1F
InChI Key: InChIKey=FESFTADQYMGBAV-UHFFFAOYSA-N
Activity Spreadsheet -- Enzyme Inhibition Constant Data from BindingDB
Found 1 hit for monomerid = 366100
Trg + Lig
Ki
nM
ΔG°
kcal/mole
IC50
nM
Kd
nM
EC50/IC50
nM
koff
s-1
kon
M-1s-1
pHTemp
°C
3-phosphoinositide-dependent protein kinase 1 [51-360]
(Homo sapiens (Human))
BDBM366100
(US9873693, Compound 23)
Show SMILES Fc1ccc(Cn2cccc(C(=O)NCc3ccc(s3)-c3c[nH]c4ncc(Cl)cc34)c2=O)cc1F
Show InChI InChI=1S/C25H17ClF2N4O2S/c26-15-9-18-19(12-30-23(18)29-10-15)22-6-4-16(35-22)11-31-24(33)17-2-1-7-32(25(17)34)13-14-3-5-20(27)21(28)8-14/h1-10,12H,11,13H2,(H,29,30)(H,31,33)
US Patent
n/an/a<500n/an/an/an/an/an/a
Duquesne University
Assay Description
A PDK1 kinase assay was performed as follows. PDK1 (amino acids 51-360) and AKT2 (amino acids 140-467 fused to PIFtide, amino acids EEQEMFRDFDYIADW) ...
J Med Chem 51: 68-76 (2008)
BindingDB Entry DOI: 10.7270/Q2H41TRT