null
SMILES: CN(C)C(=O)c1cnc2[nH]cc(-c3cccc(CNC(=O)c4cccn(Cc5ccc(F)c(F)c5)c4=O)c3)c2c1
InChI Key: InChIKey=HWJXNOIGBWZILD-UHFFFAOYSA-N
Activity Spreadsheet -- Enzyme Inhibition Constant Data from BindingDB
Found 1 hit for monomerid = 366104
Trg + Lig
Ki
nM
ΔG°
kcal/mole
IC50
nM
Kd
nM
EC50/IC50
nM
koff
s-1
kon
M-1s-1
pHTemp
°C
3-phosphoinositide-dependent protein kinase 1 [51-360]
(Homo sapiens (Human))
BDBM366104
(US9873693, Compound 27)
Show SMILES CN(C)C(=O)c1cnc2[nH]cc(-c3cccc(CNC(=O)c4cccn(Cc5ccc(F)c(F)c5)c4=O)c3)c2c1
Show InChI InChI=1S/C30H25F2N5O3/c1-36(2)29(39)21-13-23-24(16-34-27(23)33-15-21)20-6-3-5-18(11-20)14-35-28(38)22-7-4-10-37(30(22)40)17-19-8-9-25(31)26(32)12-19/h3-13,15-16H,14,17H2,1-2H3,(H,33,34)(H,35,38)
US Patent
n/an/a<500n/an/an/an/an/an/a
Duquesne University
Assay Description
A PDK1 kinase assay was performed as follows. PDK1 (amino acids 51-360) and AKT2 (amino acids 140-467 fused to PIFtide, amino acids EEQEMFRDFDYIADW) ...
J Med Chem 51: 68-76 (2008)
BindingDB Entry DOI: 10.7270/Q2H41TRT